{"text_format":"1","workbook":"xlsx","n_sheets":17,"sheets":["Vertical","Info_Prototipos_vertical","Horizontal","Info_Prototipos_horizontal","Lote","Info_Prototipos_lote","Amenidades","Creditos","Ventas","Precios","financiamiento_esquema","bon_esquema","financiamiento_detalle","Comercializadores","Desarrolladores","Tipo_cambio","Reportes"],"not_rendered":{"charts":0,"images":0,"macros":1,"external_links":1,"defined_names":4,"comments":4,"pivot_tables":0},"unopened":[],"bounds":{"document_bytes":16777216,"sheet_cells":100000,"rows_first":2000,"rows_last":500,"rows_between":2000,"halvings":0,"cell_chars":16384,"cell_head_chars":4096},"cells_cut":0,"cells_raw":0,"read":"whole","date_system":"1900"}

{"sheet":"Vertical","index":0,"n_rows":33,"n_cols":47,"rows_kept":33,"cut":false,"hidden":false,"merged":[]}
["Nombre_desarrollo","Direccion","Zona","Desarrolladora","Comercializadora","Segementación ","Número_de_etapas_total_planeadas","Etapa_actual","Material_constucción","Número_niveles","Departamentos_planeados","Número_prototipos","Descripción_departamento_x_torre","Tipo_fraccionamiento","Acceso_desarrollo","Vigilancia","Regimen_condominio","Couota_mantenimineto","Amenidades","Otro","Número_unida_1_recamara","Número_unida_2_recamara","Número_unida_3_recamara","Cajones_estacionamientos","Instalacion_Gas_lp","Instalaciones_electricas","Cisterna","Credito_puente","Precio_de_preventa","Creditos_aceptados","%_enganche","Plazo_para_pago_de_enganche_(meses)","Plazo_para_pago_de_enganche_(días)","Importe_de_apartado","Importe_de_apartado_incluye_firma_de_contrato","Precio_incluye_escrituración","Fecha_primer_levantamiento","Fecha_inicio_venta","Fecha_fin_ventas","Meses_venta","Fecha_estimada_entrega","Fecha_entrega_ofical","Fecha_inicio_construcción","Fecha_estimada_fin_contruccion","Fecha_fin_construcción","Estatus_obra","Estatus_venta"]
["Capittala- Departamentos",null,"Nor Oriente","Impulsa",null,null,1,1,"Block",null,189,2,null,"Privado","Caseta de vigilancia",null,"Si",null,"1,2,3,4,8,9,21","Ajedrez gigante, horno de piedra,  pasto cintetico, centro cuinario.",null,null,null,2,null,null,null,null,"No","3,4,5","10% a 20%",5,0,20000,"Si","No","noviembre 2019","noviembre 2019",{"$f":"IF(IFERROR(_xlfn.MINIFS(Tabla1012_1[Fecha],Tabla1012_1[Nombre_desarrollo],Tabla2[[#This Row],[Nombre_desarrollo]],Tabla1012_1[Inventario_disponible],0),\"\")>0,IFERROR(_xlfn.MINIFS(Tabla1012_1[Fecha],Tabla1012_1[Nombre_desarrollo],Tabla2[[#This Row],[Nombre_desarrollo]],Tabla1012_1[Inventario_disponible],0),\"\"),\"\")","v":""},{"$f":"IF(AND(Tabla2[[#This Row],[Fecha_inicio_venta]]=\"\",Tabla2[[#This Row],[Fecha_fin_ventas]]<>\"\"),\"Se necesita fecha_inicio_venta\",IF(AND(Tabla2[[#This Row],[Fecha_inicio_venta]]=\"\",Tabla2[[#This Row],[Fecha_fin_ventas]]=\"\"),\"\",IF(AND(Tabla2[[#This Row],[Fecha_inicio_venta]]<>\"\",Tabla2[[#This Row],[Fecha_fin_ventas]]=\"\"),(YEAR(TODAY())-YEAR(Tabla2[[#This Row],[Fecha_inicio_venta]]))*12 + MONTH(TODAY())-MONTH(Tabla2[[#This Row],[Fecha_inicio_venta]]),(YEAR(Tabla2[[#This Row],[Fecha_fin_ventas]])-YEAR(Tabla2[[#This Row],[Fecha_inicio_venta]]))*12 + MONTH(Tabla2[[#This Row],[Fecha_fin_ventas]])-MONTH(Tabla2[[#This Row],[Fecha_inicio_venta]]))))","v":71},null,null,null,null,{"$f":"IF(AU2=\"Vendido\",AM2,\"\")","v":""},{"$f":"_xlfn.IFS(AND(Tabla2[[#This Row],[Fecha_inicio_construcción]]<>\"\",Tabla2[[#This Row],[Fecha_fin_construcción]]=\"\"),\"En Construcción\",AND(Tabla2[[#This Row],[Fecha_inicio_construcción]]=\"\",Tabla2[[#This Row],[Fecha_fin_construcción]]=\"\"),\"Tierra\",AND(Tabla2[[#This Row],[Fecha_inicio_construcción]]<>\"\",Tabla2[[#This Row],[Fecha_fin_construcción]]<>\"\"),\"Terminado\",AND(Tabla2[[#This Row],[Fecha_fin_construcción]]<>\"\",Tabla2[[#This Row],[Fecha_inicio_construcción]]=\"\"),\"Falta Fecha:inicio:contruccon\")","v":"Tierra"},{"$f":"IF(IFERROR(INDEX(Tabla1012_1[Inventario_disponible],MATCH(1,(Tabla1012_1[Nombre_desarrollo]=Tabla2[[#This Row],[Nombre_desarrollo]])*(Tabla1012_1[Fecha]=_xlfn.MAXIFS(Tabla1012_1[Fecha],Tabla1012_1[Nombre_desarrollo],Tabla2[[#This Row],[Nombre_desarrollo]])),0)),\"\")=0,\"Vendido\",\"Disponible\")","v":"Disponible"}]
["Mezquite Torre Residencial","Calzada de los Mezquites #118, Fracc. Cerrada La Mezquitera","Norte","Racsa",null,null,1,1,"Block",null,17,2,null,"Privado","Caseta de vigilancia",null,"Si",2600,"10,11,22",null,null,null,null,2,null,null,null,null,"Si","3",25,1,0,50000,"Si","No","jul-21","jul-21",{"$f":"IF(IFERROR(_xlfn.MINIFS(Tabla1012_1[Fecha],Tabla1012_1[Nombre_desarrollo],Tabla2[[#This Row],[Nombre_desarrollo]],Tabla1012_1[Inventario_disponible],0),\"\")>0,IFERROR(_xlfn.MINIFS(Tabla1012_1[Fecha],Tabla1012_1[Nombre_desarrollo],Tabla2[[#This Row],[Nombre_desarrollo]],Tabla1012_1[Inventario_disponible],0),\"\"),\"\")","v":""},{"$f":"IF(AND(Tabla2[[#This Row],[Fecha_inicio_venta]]=\"\",Tabla2[[#This Row],[Fecha_fin_ventas]]<>\"\"),\"Se necesita fecha_inicio_venta\",IF(AND(Tabla2[[#This Row],[Fecha_inicio_venta]]=\"\",Tabla2[[#This Row],[Fecha_fin_ventas]]=\"\"),\"\",IF(AND(Tabla2[[#This Row],[Fecha_inicio_venta]]<>\"\",Tabla2[[#This Row],[Fecha_fin_ventas]]=\"\"),(YEAR(TODAY())-YEAR(Tabla2[[#This Row],[Fecha_inicio_venta]]))*12 + MONTH(TODAY())-MONTH(Tabla2[[#This Row],[Fecha_inicio_venta]]),(YEAR(Tabla2[[#This Row],[Fecha_fin_ventas]])-YEAR(Tabla2[[#This Row],[Fecha_inicio_venta]]))*12 + MONTH(Tabla2[[#This Row],[Fecha_fin_ventas]])-MONTH(Tabla2[[#This Row],[Fecha_inicio_venta]]))))","v":51},null,null,null,null,"",{"$f":"_xlfn.IFS(AND(Tabla2[[#This Row],[Fecha_inicio_construcción]]<>\"\",Tabla2[[#This Row],[Fecha_fin_construcción]]=\"\"),\"En Construcción\",AND(Tabla2[[#This Row],[Fecha_inicio_construcción]]=\"\",Tabla2[[#This Row],[Fecha_fin_construcción]]=\"\"),\"Tierra\",AND(Tabla2[[#This Row],[Fecha_inicio_construcción]]<>\"\",Tabla2[[#This Row],[Fecha_fin_construcción]]<>\"\"),\"Terminado\",AND(Tabla2[[#This Row],[Fecha_fin_construcción]]<>\"\",Tabla2[[#This Row],[Fecha_inicio_construcción]]=\"\"),\"Falta Fecha:inicio:contruccon\")","v":"Tierra"},{"$f":"IF(IFERROR(INDEX(Tabla1012_1[Inventario_disponible],MATCH(1,(Tabla1012_1[Nombre_desarrollo]=Tabla2[[#This Row],[Nombre_desarrollo]])*(Tabla1012_1[Fecha]=_xlfn.MAXIFS(Tabla1012_1[Fecha],Tabla1012_1[Nombre_desarrollo],Tabla2[[#This Row],[Nombre_desarrollo]])),0)),\"\")=0,\"Vendido\",\"Disponible\")","v":"Disponible"}]
["Punta de Cielo Torre","Av. Guadalupe Gonzalez","Nor Poniente","Grupo Emporium",null,"Residencial A",1,1,"Ladrillo",null,32,6,null,"Privado","Caseta de Vigilancia","Caseta de vigilancia","Si","$60.00 m2","1,2,19",null,null,null,null,1,null,null,null,null,"Si","3,4",20,8,0,null,"Si","No","mayo 2022","mayo 2022",{"$f":"IF(IFERROR(_xlfn.MINIFS(Tabla1012_1[Fecha],Tabla1012_1[Nombre_desarrollo],Tabla2[[#This Row],[Nombre_desarrollo]],Tabla1012_1[Inventario_disponible],0),\"\")>0,IFERROR(_xlfn.MINIFS(Tabla1012_1[Fecha],Tabla1012_1[Nombre_desarrollo],Tabla2[[#This Row],[Nombre_desarrollo]],Tabla1012_1[Inventario_disponible],0),\"\"),\"\")","v":""},{"$f":"IF(AND(Tabla2[[#This Row],[Fecha_inicio_venta]]=\"\",Tabla2[[#This Row],[Fecha_fin_ventas]]<>\"\"),\"Se necesita fecha_inicio_venta\",IF(AND(Tabla2[[#This Row],[Fecha_inicio_venta]]=\"\",Tabla2[[#This Row],[Fecha_fin_ventas]]=\"\"),\"\",IF(AND(Tabla2[[#This Row],[Fecha_inicio_venta]]<>\"\",Tabla2[[#This Row],[Fecha_fin_ventas]]=\"\"),(YEAR(TODAY())-YEAR(Tabla2[[#This Row],[Fecha_inicio_venta]]))*12 + MONTH(TODAY())-MONTH(Tabla2[[#This Row],[Fecha_inicio_venta]]),(YEAR(Tabla2[[#This Row],[Fecha_fin_ventas]])-YEAR(Tabla2[[#This Row],[Fecha_inicio_venta]]))*12 + MONTH(Tabla2[[#This Row],[Fecha_fin_ventas]])-MONTH(Tabla2[[#This Row],[Fecha_inicio_venta]]))))","v":41},null,null,null,null,"",{"$f":"_xlfn.IFS(AND(Tabla2[[#This Row],[Fecha_inicio_construcción]]<>\"\",Tabla2[[#This Row],[Fecha_fin_construcción]]=\"\"),\"En Construcción\",AND(Tabla2[[#This Row],[Fecha_inicio_construcción]]=\"\",Tabla2[[#This Row],[Fecha_fin_construcción]]=\"\"),\"Tierra\",AND(Tabla2[[#This Row],[Fecha_inicio_construcción]]<>\"\",Tabla2[[#This Row],[Fecha_fin_construcción]]<>\"\"),\"Terminado\",AND(Tabla2[[#This Row],[Fecha_fin_construcción]]<>\"\",Tabla2[[#This Row],[Fecha_inicio_construcción]]=\"\"),\"Falta Fecha:inicio:contruccon\")","v":"Tierra"},{"$f":"IF(IFERROR(INDEX(Tabla1012_1[Inventario_disponible],MATCH(1,(Tabla1012_1[Nombre_desarrollo]=Tabla2[[#This Row],[Nombre_desarrollo]])*(Tabla1012_1[Fecha]=_xlfn.MAXIFS(Tabla1012_1[Fecha],Tabla1012_1[Nombre_desarrollo],Tabla2[[#This Row],[Nombre_desarrollo]])),0)),\"\")=0,\"Vendido\",\"Disponible\")","v":"Disponible"}]
["Torre Beara- Torre 1","Av. Guadalupe Gonzales #1111","Nor Poniente","Terralta",null,null,1,1,"Ladrillo",null,46,4,null,"Privado","Caseta de Vigilancia","Caseta de vigilancia","Si","$30.00 m2","2,20","Garden Lounge",null,null,null,1,null,null,null,null,"No","3",15,1,0,50000,"Si","No","nov-21","nov-21",{"$f":"IF(IFERROR(_xlfn.MINIFS(Tabla1012_1[Fecha],Tabla1012_1[Nombre_desarrollo],Tabla2[[#This Row],[Nombre_desarrollo]],Tabla1012_1[Inventario_disponible],0),\"\")>0,IFERROR(_xlfn.MINIFS(Tabla1012_1[Fecha],Tabla1012_1[Nombre_desarrollo],Tabla2[[#This Row],[Nombre_desarrollo]],Tabla1012_1[Inventario_disponible],0),\"\"),\"\")","v":""},{"$f":"IF(AND(Tabla2[[#This Row],[Fecha_inicio_venta]]=\"\",Tabla2[[#This Row],[Fecha_fin_ventas]]<>\"\"),\"Se necesita fecha_inicio_venta\",IF(AND(Tabla2[[#This Row],[Fecha_inicio_venta]]=\"\",Tabla2[[#This Row],[Fecha_fin_ventas]]=\"\"),\"\",IF(AND(Tabla2[[#This Row],[Fecha_inicio_venta]]<>\"\",Tabla2[[#This Row],[Fecha_fin_ventas]]=\"\"),(YEAR(TODAY())-YEAR(Tabla2[[#This Row],[Fecha_inicio_venta]]))*12 + MONTH(TODAY())-MONTH(Tabla2[[#This Row],[Fecha_inicio_venta]]),(YEAR(Tabla2[[#This Row],[Fecha_fin_ventas]])-YEAR(Tabla2[[#This Row],[Fecha_inicio_venta]]))*12 + MONTH(Tabla2[[#This Row],[Fecha_fin_ventas]])-MONTH(Tabla2[[#This Row],[Fecha_inicio_venta]]))))","v":47},null,null,null,null,"",{"$f":"_xlfn.IFS(AND(Tabla2[[#This Row],[Fecha_inicio_construcción]]<>\"\",Tabla2[[#This Row],[Fecha_fin_construcción]]=\"\"),\"En Construcción\",AND(Tabla2[[#This Row],[Fecha_inicio_construcción]]=\"\",Tabla2[[#This Row],[Fecha_fin_construcción]]=\"\"),\"Tierra\",AND(Tabla2[[#This Row],[Fecha_inicio_construcción]]<>\"\",Tabla2[[#This Row],[Fecha_fin_construcción]]<>\"\"),\"Terminado\",AND(Tabla2[[#This Row],[Fecha_fin_construcción]]<>\"\",Tabla2[[#This Row],[Fecha_inicio_construcción]]=\"\"),\"Falta Fecha:inicio:contruccon\")","v":"Tierra"},{"$f":"IF(IFERROR(INDEX(Tabla1012_1[Inventario_disponible],MATCH(1,(Tabla1012_1[Nombre_desarrollo]=Tabla2[[#This Row],[Nombre_desarrollo]])*(Tabla1012_1[Fecha]=_xlfn.MAXIFS(Tabla1012_1[Fecha],Tabla1012_1[Nombre_desarrollo],Tabla2[[#This Row],[Nombre_desarrollo]])),0)),\"\")=0,\"Vendido\",\"Disponible\")","v":"Disponible"}]
["Torre Beara- Torre 2","Av. Guadalupe Gonzales #1111","Nor Poniente","Terralta",null,"Residencial A",2,2,"Ladrillo",null,48,4,null,"Privado","Caseta de Vigilancia","Caseta de vigilancia","Si","$30.00 m2","2,20","Garden Lounge",null,null,null,1,null,null,null,null,"No","3",15,1,0,50000,"Si","No","sept/22","sept/22",{"$f":"IF(IFERROR(_xlfn.MINIFS(Tabla1012_1[Fecha],Tabla1012_1[Nombre_desarrollo],Tabla2[[#This Row],[Nombre_desarrollo]],Tabla1012_1[Inventario_disponible],0),\"\")>0,IFERROR(_xlfn.MINIFS(Tabla1012_1[Fecha],Tabla1012_1[Nombre_desarrollo],Tabla2[[#This Row],[Nombre_desarrollo]],Tabla1012_1[Inventario_disponible],0),\"\"),\"\")","v":""},{"$f":"IF(AND(Tabla2[[#This Row],[Fecha_inicio_venta]]=\"\",Tabla2[[#This Row],[Fecha_fin_ventas]]<>\"\"),\"Se necesita fecha_inicio_venta\",IF(AND(Tabla2[[#This Row],[Fecha_inicio_venta]]=\"\",Tabla2[[#This Row],[Fecha_fin_ventas]]=\"\"),\"\",IF(AND(Tabla2[[#This Row],[Fecha_inicio_venta]]<>\"\",Tabla2[[#This Row],[Fecha_fin_ventas]]=\"\"),(YEAR(TODAY())-YEAR(Tabla2[[#This Row],[Fecha_inicio_venta]]))*12 + MONTH(TODAY())-MONTH(Tabla2[[#This Row],[Fecha_inicio_venta]]),(YEAR(Tabla2[[#This Row],[Fecha_fin_ventas]])-YEAR(Tabla2[[#This Row],[Fecha_inicio_venta]]))*12 + MONTH(Tabla2[[#This Row],[Fecha_fin_ventas]])-MONTH(Tabla2[[#This Row],[Fecha_inicio_venta]]))))","v":37},null,null,null,null,"",{"$f":"_xlfn.IFS(AND(Tabla2[[#This Row],[Fecha_inicio_construcción]]<>\"\",Tabla2[[#This Row],[Fecha_fin_construcción]]=\"\"),\"En Construcción\",AND(Tabla2[[#This Row],[Fecha_inicio_construcción]]=\"\",Tabla2[[#This Row],[Fecha_fin_construcción]]=\"\"),\"Tierra\",AND(Tabla2[[#This Row],[Fecha_inicio_construcción]]<>\"\",Tabla2[[#This Row],[Fecha_fin_construcción]]<>\"\"),\"Terminado\",AND(Tabla2[[#This Row],[Fecha_fin_construcción]]<>\"\",Tabla2[[#This Row],[Fecha_inicio_construcción]]=\"\"),\"Falta Fecha:inicio:contruccon\")","v":"Tierra"},{"$f":"IF(IFERROR(INDEX(Tabla1012_1[Inventario_disponible],MATCH(1,(Tabla1012_1[Nombre_desarrollo]=Tabla2[[#This Row],[Nombre_desarrollo]])*(Tabla1012_1[Fecha]=_xlfn.MAXIFS(Tabla1012_1[Fecha],Tabla1012_1[Nombre_desarrollo],Tabla2[[#This Row],[Nombre_desarrollo]])),0)),\"\")=0,\"Vendido\",\"Disponible\")","v":"Disponible"}]
["Torre Laurel","Monteblanco #105, Lomas del Campestre",null,"Grupo Eco brava México- Almikia Inmobiliaria",null,null,1,1,null,null,12,1,null,"Abierto","Caseta de vigilancia",null,null,0,"",null,null,null,null,1,null,null,null,null,null,"",null,null,null,null,null,null,"may-21","may-21",{"$f":"IF(IFERROR(_xlfn.MINIFS(Tabla1012_1[Fecha],Tabla1012_1[Nombre_desarrollo],Tabla2[[#This Row],[Nombre_desarrollo]],Tabla1012_1[Inventario_disponible],0),\"\")>0,IFERROR(_xlfn.MINIFS(Tabla1012_1[Fecha],Tabla1012_1[Nombre_desarrollo],Tabla2[[#This Row],[Nombre_desarrollo]],Tabla1012_1[Inventario_disponible],0),\"\"),\"\")","v":""},{"$f":"IF(AND(Tabla2[[#This Row],[Fecha_inicio_venta]]=\"\",Tabla2[[#This Row],[Fecha_fin_ventas]]<>\"\"),\"Se necesita fecha_inicio_venta\",IF(AND(Tabla2[[#This Row],[Fecha_inicio_venta]]=\"\",Tabla2[[#This Row],[Fecha_fin_ventas]]=\"\"),\"\",IF(AND(Tabla2[[#This Row],[Fecha_inicio_venta]]<>\"\",Tabla2[[#This Row],[Fecha_fin_ventas]]=\"\"),(YEAR(TODAY())-YEAR(Tabla2[[#This Row],[Fecha_inicio_venta]]))*12 + MONTH(TODAY())-MONTH(Tabla2[[#This Row],[Fecha_inicio_venta]]),(YEAR(Tabla2[[#This Row],[Fecha_fin_ventas]])-YEAR(Tabla2[[#This Row],[Fecha_inicio_venta]]))*12 + MONTH(Tabla2[[#This Row],[Fecha_fin_ventas]])-MONTH(Tabla2[[#This Row],[Fecha_inicio_venta]]))))","v":53},null,null,null,null,"",{"$f":"_xlfn.IFS(AND(Tabla2[[#This Row],[Fecha_inicio_construcción]]<>\"\",Tabla2[[#This Row],[Fecha_fin_construcción]]=\"\"),\"En Construcción\",AND(Tabla2[[#This Row],[Fecha_inicio_construcción]]=\"\",Tabla2[[#This Row],[Fecha_fin_construcción]]=\"\"),\"Tierra\",AND(Tabla2[[#This Row],[Fecha_inicio_construcción]]<>\"\",Tabla2[[#This Row],[Fecha_fin_construcción]]<>\"\"),\"Terminado\",AND(Tabla2[[#This Row],[Fecha_fin_construcción]]<>\"\",Tabla2[[#This Row],[Fecha_inicio_construcción]]=\"\"),\"Falta Fecha:inicio:contruccon\")","v":"Tierra"},{"$f":"IF(IFERROR(INDEX(Tabla1012_1[Inventario_disponible],MATCH(1,(Tabla1012_1[Nombre_desarrollo]=Tabla2[[#This Row],[Nombre_desarrollo]])*(Tabla1012_1[Fecha]=_xlfn.MAXIFS(Tabla1012_1[Fecha],Tabla1012_1[Nombre_desarrollo],Tabla2[[#This Row],[Nombre_desarrollo]])),0)),\"\")=0,\"Vendido\",\"Disponible\")","v":"Disponible"}]
["Torres Verona",null,null,"Grupo San Cristobal",null,null,4,4,"Block",null,12,0,null,"Privado","Caseta de vigilancia","Caseta de vigilancia","Si",450,"1,2,3,19","Área de juegos infantiles.",null,null,null,1,null,null,null,null,"Si","1,2,3",0.1,1,0,5000,"No","No","2023-01-01","2023-01-01",{"$f":"IF(IFERROR(_xlfn.MINIFS(Tabla1012_1[Fecha],Tabla1012_1[Nombre_desarrollo],Tabla2[[#This Row],[Nombre_desarrollo]],Tabla1012_1[Inventario_disponible],0),\"\")>0,IFERROR(_xlfn.MINIFS(Tabla1012_1[Fecha],Tabla1012_1[Nombre_desarrollo],Tabla2[[#This Row],[Nombre_desarrollo]],Tabla1012_1[Inventario_disponible],0),\"\"),\"\")","v":""},{"$f":"IF(AND(Tabla2[[#This Row],[Fecha_inicio_venta]]=\"\",Tabla2[[#This Row],[Fecha_fin_ventas]]<>\"\"),\"Se necesita fecha_inicio_venta\",IF(AND(Tabla2[[#This Row],[Fecha_inicio_venta]]=\"\",Tabla2[[#This Row],[Fecha_fin_ventas]]=\"\"),\"\",IF(AND(Tabla2[[#This Row],[Fecha_inicio_venta]]<>\"\",Tabla2[[#This Row],[Fecha_fin_ventas]]=\"\"),(YEAR(TODAY())-YEAR(Tabla2[[#This Row],[Fecha_inicio_venta]]))*12 + MONTH(TODAY())-MONTH(Tabla2[[#This Row],[Fecha_inicio_venta]]),(YEAR(Tabla2[[#This Row],[Fecha_fin_ventas]])-YEAR(Tabla2[[#This Row],[Fecha_inicio_venta]]))*12 + MONTH(Tabla2[[#This Row],[Fecha_fin_ventas]])-MONTH(Tabla2[[#This Row],[Fecha_inicio_venta]]))))","v":33},null,null,null,null,"",{"$f":"_xlfn.IFS(AND(Tabla2[[#This Row],[Fecha_inicio_construcción]]<>\"\",Tabla2[[#This Row],[Fecha_fin_construcción]]=\"\"),\"En Construcción\",AND(Tabla2[[#This Row],[Fecha_inicio_construcción]]=\"\",Tabla2[[#This Row],[Fecha_fin_construcción]]=\"\"),\"Tierra\",AND(Tabla2[[#This Row],[Fecha_inicio_construcción]]<>\"\",Tabla2[[#This Row],[Fecha_fin_construcción]]<>\"\"),\"Terminado\",AND(Tabla2[[#This Row],[Fecha_fin_construcción]]<>\"\",Tabla2[[#This Row],[Fecha_inicio_construcción]]=\"\"),\"Falta Fecha:inicio:contruccon\")","v":"Tierra"},{"$f":"IF(IFERROR(INDEX(Tabla1012_1[Inventario_disponible],MATCH(1,(Tabla1012_1[Nombre_desarrollo]=Tabla2[[#This Row],[Nombre_desarrollo]])*(Tabla1012_1[Fecha]=_xlfn.MAXIFS(Tabla1012_1[Fecha],Tabla1012_1[Nombre_desarrollo],Tabla2[[#This Row],[Nombre_desarrollo]])),0)),\"\")=0,\"Vendido\",\"Disponible\")","v":"Disponible"}]
["Mision 208- deptos","Av de las misiones 208, cerrada de la mision","Norte","Aujaus",null,"Residencial A",1,1,"ladrillo rojo",3,24,5,null,"Privado","Caseta de vigilancia","Acceso controlado 24/7","Si",2300,"2,19","cuentan con elevador",null,null,null,2,null,null,null,null,"Si","1,2,3,4","30%,50% y 80%",1,0,50000,"Si","No","abril 23","abril 23",{"$f":"IF(IFERROR(_xlfn.MINIFS(Tabla1012_1[Fecha],Tabla1012_1[Nombre_desarrollo],Tabla2[[#This Row],[Nombre_desarrollo]],Tabla1012_1[Inventario_disponible],0),\"\")>0,IFERROR(_xlfn.MINIFS(Tabla1012_1[Fecha],Tabla1012_1[Nombre_desarrollo],Tabla2[[#This Row],[Nombre_desarrollo]],Tabla1012_1[Inventario_disponible],0),\"\"),\"\")","v":""},{"$f":"IF(AND(Tabla2[[#This Row],[Fecha_inicio_venta]]=\"\",Tabla2[[#This Row],[Fecha_fin_ventas]]<>\"\"),\"Se necesita fecha_inicio_venta\",IF(AND(Tabla2[[#This Row],[Fecha_inicio_venta]]=\"\",Tabla2[[#This Row],[Fecha_fin_ventas]]=\"\"),\"\",IF(AND(Tabla2[[#This Row],[Fecha_inicio_venta]]<>\"\",Tabla2[[#This Row],[Fecha_fin_ventas]]=\"\"),(YEAR(TODAY())-YEAR(Tabla2[[#This Row],[Fecha_inicio_venta]]))*12 + MONTH(TODAY())-MONTH(Tabla2[[#This Row],[Fecha_inicio_venta]]),(YEAR(Tabla2[[#This Row],[Fecha_fin_ventas]])-YEAR(Tabla2[[#This Row],[Fecha_inicio_venta]]))*12 + MONTH(Tabla2[[#This Row],[Fecha_fin_ventas]])-MONTH(Tabla2[[#This Row],[Fecha_inicio_venta]]))))","v":30},"2023-03-24",null,null,null,"",{"$f":"_xlfn.IFS(AND(Tabla2[[#This Row],[Fecha_inicio_construcción]]<>\"\",Tabla2[[#This Row],[Fecha_fin_construcción]]=\"\"),\"En Construcción\",AND(Tabla2[[#This Row],[Fecha_inicio_construcción]]=\"\",Tabla2[[#This Row],[Fecha_fin_construcción]]=\"\"),\"Tierra\",AND(Tabla2[[#This Row],[Fecha_inicio_construcción]]<>\"\",Tabla2[[#This Row],[Fecha_fin_construcción]]<>\"\"),\"Terminado\",AND(Tabla2[[#This Row],[Fecha_fin_construcción]]<>\"\",Tabla2[[#This Row],[Fecha_inicio_construcción]]=\"\"),\"Falta Fecha:inicio:contruccon\")","v":"Tierra"},{"$f":"IF(IFERROR(INDEX(Tabla1012_1[Inventario_disponible],MATCH(1,(Tabla1012_1[Nombre_desarrollo]=Tabla2[[#This Row],[Nombre_desarrollo]])*(Tabla1012_1[Fecha]=_xlfn.MAXIFS(Tabla1012_1[Fecha],Tabla1012_1[Nombre_desarrollo],Tabla2[[#This Row],[Nombre_desarrollo]])),0)),\"\")=0,\"Vendido\",\"Disponible\")","v":"Disponible"}]
["Reserva Quetzales Torres","Carretera la Guayana, San Francisco de los Romos",null,"Grupo San Cristobal",null,null,3,1,"Block",null,6,3,null,"Privado","Caseta de vigilancia","Caseta de vigilancia","Si",350,"1,2,3,19","Área de juegos infantiles.",null,null,null,1,null,null,null,null,"Si","1,2,3",0.1,1,0,5000,"No","No","2023-04-23","2023-04-23",{"$f":"IF(IFERROR(_xlfn.MINIFS(Tabla1012_1[Fecha],Tabla1012_1[Nombre_desarrollo],Tabla2[[#This Row],[Nombre_desarrollo]],Tabla1012_1[Inventario_disponible],0),\"\")>0,IFERROR(_xlfn.MINIFS(Tabla1012_1[Fecha],Tabla1012_1[Nombre_desarrollo],Tabla2[[#This Row],[Nombre_desarrollo]],Tabla1012_1[Inventario_disponible],0),\"\"),\"\")","v":""},{"$f":"IF(AND(Tabla2[[#This Row],[Fecha_inicio_venta]]=\"\",Tabla2[[#This Row],[Fecha_fin_ventas]]<>\"\"),\"Se necesita fecha_inicio_venta\",IF(AND(Tabla2[[#This Row],[Fecha_inicio_venta]]=\"\",Tabla2[[#This Row],[Fecha_fin_ventas]]=\"\"),\"\",IF(AND(Tabla2[[#This Row],[Fecha_inicio_venta]]<>\"\",Tabla2[[#This Row],[Fecha_fin_ventas]]=\"\"),(YEAR(TODAY())-YEAR(Tabla2[[#This Row],[Fecha_inicio_venta]]))*12 + MONTH(TODAY())-MONTH(Tabla2[[#This Row],[Fecha_inicio_venta]]),(YEAR(Tabla2[[#This Row],[Fecha_fin_ventas]])-YEAR(Tabla2[[#This Row],[Fecha_inicio_venta]]))*12 + MONTH(Tabla2[[#This Row],[Fecha_fin_ventas]])-MONTH(Tabla2[[#This Row],[Fecha_inicio_venta]]))))","v":30},null,null,null,null,"",{"$f":"_xlfn.IFS(AND(Tabla2[[#This Row],[Fecha_inicio_construcción]]<>\"\",Tabla2[[#This Row],[Fecha_fin_construcción]]=\"\"),\"En Construcción\",AND(Tabla2[[#This Row],[Fecha_inicio_construcción]]=\"\",Tabla2[[#This Row],[Fecha_fin_construcción]]=\"\"),\"Tierra\",AND(Tabla2[[#This Row],[Fecha_inicio_construcción]]<>\"\",Tabla2[[#This Row],[Fecha_fin_construcción]]<>\"\"),\"Terminado\",AND(Tabla2[[#This Row],[Fecha_fin_construcción]]<>\"\",Tabla2[[#This Row],[Fecha_inicio_construcción]]=\"\"),\"Falta Fecha:inicio:contruccon\")","v":"Tierra"},{"$f":"IF(IFERROR(INDEX(Tabla1012_1[Inventario_disponible],MATCH(1,(Tabla1012_1[Nombre_desarrollo]=Tabla2[[#This Row],[Nombre_desarrollo]])*(Tabla1012_1[Fecha]=_xlfn.MAXIFS(Tabla1012_1[Fecha],Tabla1012_1[Nombre_desarrollo],Tabla2[[#This Row],[Nombre_desarrollo]])),0)),\"\")=0,\"Vendido\",\"Disponible\")","v":"Disponible"}]
["Via 422","Florida422, Tepetate, jesus maria","Jesús Maria","Garcam",null,"Residencial A",1,1,"ladrillo rojo",0,26,5,null,"Privado","Caseta de vigilancia","Acceso controlado 24/7","Si",1450,"1,2,3,4,6,7,8",null,null,null,null,1,null,null,null,null,"Si","1,2,3,5",0.3,1,0,50000,"Si","No","2020-05-01","2020-05-01",{"$f":"IF(IFERROR(_xlfn.MINIFS(Tabla1012_1[Fecha],Tabla1012_1[Nombre_desarrollo],Tabla2[[#This Row],[Nombre_desarrollo]],Tabla1012_1[Inventario_disponible],0),\"\")>0,IFERROR(_xlfn.MINIFS(Tabla1012_1[Fecha],Tabla1012_1[Nombre_desarrollo],Tabla2[[#This Row],[Nombre_desarrollo]],Tabla1012_1[Inventario_disponible],0),\"\"),\"\")","v":""},{"$f":"IF(AND(Tabla2[[#This Row],[Fecha_inicio_venta]]=\"\",Tabla2[[#This Row],[Fecha_fin_ventas]]<>\"\"),\"Se necesita fecha_inicio_venta\",IF(AND(Tabla2[[#This Row],[Fecha_inicio_venta]]=\"\",Tabla2[[#This Row],[Fecha_fin_ventas]]=\"\"),\"\",IF(AND(Tabla2[[#This Row],[Fecha_inicio_venta]]<>\"\",Tabla2[[#This Row],[Fecha_fin_ventas]]=\"\"),(YEAR(TODAY())-YEAR(Tabla2[[#This Row],[Fecha_inicio_venta]]))*12 + MONTH(TODAY())-MONTH(Tabla2[[#This Row],[Fecha_inicio_venta]]),(YEAR(Tabla2[[#This Row],[Fecha_fin_ventas]])-YEAR(Tabla2[[#This Row],[Fecha_inicio_venta]]))*12 + MONTH(Tabla2[[#This Row],[Fecha_fin_ventas]])-MONTH(Tabla2[[#This Row],[Fecha_inicio_venta]]))))","v":65},null,null,null,null,"",{"$f":"_xlfn.IFS(AND(Tabla2[[#This Row],[Fecha_inicio_construcción]]<>\"\",Tabla2[[#This Row],[Fecha_fin_construcción]]=\"\"),\"En Construcción\",AND(Tabla2[[#This Row],[Fecha_inicio_construcción]]=\"\",Tabla2[[#This Row],[Fecha_fin_construcción]]=\"\"),\"Tierra\",AND(Tabla2[[#This Row],[Fecha_inicio_construcción]]<>\"\",Tabla2[[#This Row],[Fecha_fin_construcción]]<>\"\"),\"Terminado\",AND(Tabla2[[#This Row],[Fecha_fin_construcción]]<>\"\",Tabla2[[#This Row],[Fecha_inicio_construcción]]=\"\"),\"Falta Fecha:inicio:contruccon\")","v":"Tierra"},{"$f":"IF(IFERROR(INDEX(Tabla1012_1[Inventario_disponible],MATCH(1,(Tabla1012_1[Nombre_desarrollo]=Tabla2[[#This Row],[Nombre_desarrollo]])*(Tabla1012_1[Fecha]=_xlfn.MAXIFS(Tabla1012_1[Fecha],Tabla1012_1[Nombre_desarrollo],Tabla2[[#This Row],[Nombre_desarrollo]])),0)),\"\")=0,\"Vendido\",\"Disponible\")","v":"Disponible"}]
["Torre Canteras","Paseo de la cantera, Canteras de San Javier, Ags.",null,"REGAL",null,null,1,1,"Block",null,21,3,null,"Privado","Caseta de vigilancia",null,"Si",null,"10,22,28,39",null,null,null,null,1,null,null,null,null,"Si","1,2,3,5",0.1,1,0,10000,"Si","No","SEP 23","SEP 23",{"$f":"IF(IFERROR(_xlfn.MINIFS(Tabla1012_1[Fecha],Tabla1012_1[Nombre_desarrollo],Tabla2[[#This Row],[Nombre_desarrollo]],Tabla1012_1[Inventario_disponible],0),\"\")>0,IFERROR(_xlfn.MINIFS(Tabla1012_1[Fecha],Tabla1012_1[Nombre_desarrollo],Tabla2[[#This Row],[Nombre_desarrollo]],Tabla1012_1[Inventario_disponible],0),\"\"),\"\")","v":""},{"$f":"IF(AND(Tabla2[[#This Row],[Fecha_inicio_venta]]=\"\",Tabla2[[#This Row],[Fecha_fin_ventas]]<>\"\"),\"Se necesita fecha_inicio_venta\",IF(AND(Tabla2[[#This Row],[Fecha_inicio_venta]]=\"\",Tabla2[[#This Row],[Fecha_fin_ventas]]=\"\"),\"\",IF(AND(Tabla2[[#This Row],[Fecha_inicio_venta]]<>\"\",Tabla2[[#This Row],[Fecha_fin_ventas]]=\"\"),(YEAR(TODAY())-YEAR(Tabla2[[#This Row],[Fecha_inicio_venta]]))*12 + MONTH(TODAY())-MONTH(Tabla2[[#This Row],[Fecha_inicio_venta]]),(YEAR(Tabla2[[#This Row],[Fecha_fin_ventas]])-YEAR(Tabla2[[#This Row],[Fecha_inicio_venta]]))*12 + MONTH(Tabla2[[#This Row],[Fecha_fin_ventas]])-MONTH(Tabla2[[#This Row],[Fecha_inicio_venta]]))))","v":25},null,null,null,null,"",{"$f":"_xlfn.IFS(AND(Tabla2[[#This Row],[Fecha_inicio_construcción]]<>\"\",Tabla2[[#This Row],[Fecha_fin_construcción]]=\"\"),\"En Construcción\",AND(Tabla2[[#This Row],[Fecha_inicio_construcción]]=\"\",Tabla2[[#This Row],[Fecha_fin_construcción]]=\"\"),\"Tierra\",AND(Tabla2[[#This Row],[Fecha_inicio_construcción]]<>\"\",Tabla2[[#This Row],[Fecha_fin_construcción]]<>\"\"),\"Terminado\",AND(Tabla2[[#This Row],[Fecha_fin_construcción]]<>\"\",Tabla2[[#This Row],[Fecha_inicio_construcción]]=\"\"),\"Falta Fecha:inicio:contruccon\")","v":"Tierra"},{"$f":"IF(IFERROR(INDEX(Tabla1012_1[Inventario_disponible],MATCH(1,(Tabla1012_1[Nombre_desarrollo]=Tabla2[[#This Row],[Nombre_desarrollo]])*(Tabla1012_1[Fecha]=_xlfn.MAXIFS(Tabla1012_1[Fecha],Tabla1012_1[Nombre_desarrollo],Tabla2[[#This Row],[Nombre_desarrollo]])),0)),\"\")=0,\"Vendido\",\"Disponible\")","v":"Disponible"}]
["Vilanova Departamentos",null,"Sur Poniente","Impulsa",null,"Media",1,1,"Block",null,54,0,null,"Privado","Caseta de vigilancia","Caseta de vigilancia","Si",null,"2,3,4,6,11,17,26",null,null,null,null,1,null,null,null,null,"Si","1,3,4","10% a 20%",7,0,20000,"Si ","No","Septiembre 2023","Septiembre 2023",{"$f":"IF(IFERROR(_xlfn.MINIFS(Tabla1012_1[Fecha],Tabla1012_1[Nombre_desarrollo],Tabla2[[#This Row],[Nombre_desarrollo]],Tabla1012_1[Inventario_disponible],0),\"\")>0,IFERROR(_xlfn.MINIFS(Tabla1012_1[Fecha],Tabla1012_1[Nombre_desarrollo],Tabla2[[#This Row],[Nombre_desarrollo]],Tabla1012_1[Inventario_disponible],0),\"\"),\"\")","v":""},{"$f":"IF(AND(Tabla2[[#This Row],[Fecha_inicio_venta]]=\"\",Tabla2[[#This Row],[Fecha_fin_ventas]]<>\"\"),\"Se necesita fecha_inicio_venta\",IF(AND(Tabla2[[#This Row],[Fecha_inicio_venta]]=\"\",Tabla2[[#This Row],[Fecha_fin_ventas]]=\"\"),\"\",IF(AND(Tabla2[[#This Row],[Fecha_inicio_venta]]<>\"\",Tabla2[[#This Row],[Fecha_fin_ventas]]=\"\"),(YEAR(TODAY())-YEAR(Tabla2[[#This Row],[Fecha_inicio_venta]]))*12 + MONTH(TODAY())-MONTH(Tabla2[[#This Row],[Fecha_inicio_venta]]),(YEAR(Tabla2[[#This Row],[Fecha_fin_ventas]])-YEAR(Tabla2[[#This Row],[Fecha_inicio_venta]]))*12 + MONTH(Tabla2[[#This Row],[Fecha_fin_ventas]])-MONTH(Tabla2[[#This Row],[Fecha_inicio_venta]]))))","v":25},null,null,null,null,"",{"$f":"_xlfn.IFS(AND(Tabla2[[#This Row],[Fecha_inicio_construcción]]<>\"\",Tabla2[[#This Row],[Fecha_fin_construcción]]=\"\"),\"En Construcción\",AND(Tabla2[[#This Row],[Fecha_inicio_construcción]]=\"\",Tabla2[[#This Row],[Fecha_fin_construcción]]=\"\"),\"Tierra\",AND(Tabla2[[#This Row],[Fecha_inicio_construcción]]<>\"\",Tabla2[[#This Row],[Fecha_fin_construcción]]<>\"\"),\"Terminado\",AND(Tabla2[[#This Row],[Fecha_fin_construcción]]<>\"\",Tabla2[[#This Row],[Fecha_inicio_construcción]]=\"\"),\"Falta Fecha:inicio:contruccon\")","v":"Tierra"},{"$f":"IF(IFERROR(INDEX(Tabla1012_1[Inventario_disponible],MATCH(1,(Tabla1012_1[Nombre_desarrollo]=Tabla2[[#This Row],[Nombre_desarrollo]])*(Tabla1012_1[Fecha]=_xlfn.MAXIFS(Tabla1012_1[Fecha],Tabla1012_1[Nombre_desarrollo],Tabla2[[#This Row],[Nombre_desarrollo]])),0)),\"\")=0,\"Vendido\",\"Disponible\")","v":"Disponible"}]
["Ferrara Departamentos",null,null,"Impulsa",null,null,1,1,"Block",null,21,4,null,"Privado","Caseta de vigilancia","Caseta de vigilancia","Si",null,"1,3,11,18,21","Espejo de Agua",null,null,null,1,null,null,null,null,"Si","1,3,4","10% a 20%",7,0,20000,"Si ","No","Octubre 2023","Octubre 2023",{"$f":"IF(IFERROR(_xlfn.MINIFS(Tabla1012_1[Fecha],Tabla1012_1[Nombre_desarrollo],Tabla2[[#This Row],[Nombre_desarrollo]],Tabla1012_1[Inventario_disponible],0),\"\")>0,IFERROR(_xlfn.MINIFS(Tabla1012_1[Fecha],Tabla1012_1[Nombre_desarrollo],Tabla2[[#This Row],[Nombre_desarrollo]],Tabla1012_1[Inventario_disponible],0),\"\"),\"\")","v":""},{"$f":"IF(AND(Tabla2[[#This Row],[Fecha_inicio_venta]]=\"\",Tabla2[[#This Row],[Fecha_fin_ventas]]<>\"\"),\"Se necesita fecha_inicio_venta\",IF(AND(Tabla2[[#This Row],[Fecha_inicio_venta]]=\"\",Tabla2[[#This Row],[Fecha_fin_ventas]]=\"\"),\"\",IF(AND(Tabla2[[#This Row],[Fecha_inicio_venta]]<>\"\",Tabla2[[#This Row],[Fecha_fin_ventas]]=\"\"),(YEAR(TODAY())-YEAR(Tabla2[[#This Row],[Fecha_inicio_venta]]))*12 + MONTH(TODAY())-MONTH(Tabla2[[#This Row],[Fecha_inicio_venta]]),(YEAR(Tabla2[[#This Row],[Fecha_fin_ventas]])-YEAR(Tabla2[[#This Row],[Fecha_inicio_venta]]))*12 + MONTH(Tabla2[[#This Row],[Fecha_fin_ventas]])-MONTH(Tabla2[[#This Row],[Fecha_inicio_venta]]))))","v":24},null,null,null,null,"",{"$f":"_xlfn.IFS(AND(Tabla2[[#This Row],[Fecha_inicio_construcción]]<>\"\",Tabla2[[#This Row],[Fecha_fin_construcción]]=\"\"),\"En Construcción\",AND(Tabla2[[#This Row],[Fecha_inicio_construcción]]=\"\",Tabla2[[#This Row],[Fecha_fin_construcción]]=\"\"),\"Tierra\",AND(Tabla2[[#This Row],[Fecha_inicio_construcción]]<>\"\",Tabla2[[#This Row],[Fecha_fin_construcción]]<>\"\"),\"Terminado\",AND(Tabla2[[#This Row],[Fecha_fin_construcción]]<>\"\",Tabla2[[#This Row],[Fecha_inicio_construcción]]=\"\"),\"Falta Fecha:inicio:contruccon\")","v":"Tierra"},{"$f":"IF(IFERROR(INDEX(Tabla1012_1[Inventario_disponible],MATCH(1,(Tabla1012_1[Nombre_desarrollo]=Tabla2[[#This Row],[Nombre_desarrollo]])*(Tabla1012_1[Fecha]=_xlfn.MAXIFS(Tabla1012_1[Fecha],Tabla1012_1[Nombre_desarrollo],Tabla2[[#This Row],[Nombre_desarrollo]])),0)),\"\")=0,\"Vendido\",\"Disponible\")","v":"Disponible"}]
["Sentzia loft&living","bosques del paraiso 112 Col tepetates","Jesús Maria","Prohimek",null,"Residencial A",1,1,"Block",8,47,4,null,"Privado","Caseta de vigilancia","Vigilancia 24/7","Si",1200,"1,8,10,11,12,18,19,20,22,24,25,31,39,47",null,null,null,null,2,null,null,null,null,"Si","1,2,3,5",0.2,1,0,30000,"Si","No","enero 2023","enero 2023",{"$f":"IF(IFERROR(_xlfn.MINIFS(Tabla1012_1[Fecha],Tabla1012_1[Nombre_desarrollo],Tabla2[[#This Row],[Nombre_desarrollo]],Tabla1012_1[Inventario_disponible],0),\"\")>0,IFERROR(_xlfn.MINIFS(Tabla1012_1[Fecha],Tabla1012_1[Nombre_desarrollo],Tabla2[[#This Row],[Nombre_desarrollo]],Tabla1012_1[Inventario_disponible],0),\"\"),\"\")","v":""},{"$f":"IF(AND(Tabla2[[#This Row],[Fecha_inicio_venta]]=\"\",Tabla2[[#This Row],[Fecha_fin_ventas]]<>\"\"),\"Se necesita fecha_inicio_venta\",IF(AND(Tabla2[[#This Row],[Fecha_inicio_venta]]=\"\",Tabla2[[#This Row],[Fecha_fin_ventas]]=\"\"),\"\",IF(AND(Tabla2[[#This Row],[Fecha_inicio_venta]]<>\"\",Tabla2[[#This Row],[Fecha_fin_ventas]]=\"\"),(YEAR(TODAY())-YEAR(Tabla2[[#This Row],[Fecha_inicio_venta]]))*12 + MONTH(TODAY())-MONTH(Tabla2[[#This Row],[Fecha_inicio_venta]]),(YEAR(Tabla2[[#This Row],[Fecha_fin_ventas]])-YEAR(Tabla2[[#This Row],[Fecha_inicio_venta]]))*12 + MONTH(Tabla2[[#This Row],[Fecha_fin_ventas]])-MONTH(Tabla2[[#This Row],[Fecha_inicio_venta]]))))","v":33},null,null,null,null,"",{"$f":"_xlfn.IFS(AND(Tabla2[[#This Row],[Fecha_inicio_construcción]]<>\"\",Tabla2[[#This Row],[Fecha_fin_construcción]]=\"\"),\"En Construcción\",AND(Tabla2[[#This Row],[Fecha_inicio_construcción]]=\"\",Tabla2[[#This Row],[Fecha_fin_construcción]]=\"\"),\"Tierra\",AND(Tabla2[[#This Row],[Fecha_inicio_construcción]]<>\"\",Tabla2[[#This Row],[Fecha_fin_construcción]]<>\"\"),\"Terminado\",AND(Tabla2[[#This Row],[Fecha_fin_construcción]]<>\"\",Tabla2[[#This Row],[Fecha_inicio_construcción]]=\"\"),\"Falta Fecha:inicio:contruccon\")","v":"Tierra"},{"$f":"IF(IFERROR(INDEX(Tabla1012_1[Inventario_disponible],MATCH(1,(Tabla1012_1[Nombre_desarrollo]=Tabla2[[#This Row],[Nombre_desarrollo]])*(Tabla1012_1[Fecha]=_xlfn.MAXIFS(Tabla1012_1[Fecha],Tabla1012_1[Nombre_desarrollo],Tabla2[[#This Row],[Nombre_desarrollo]])),0)),\"\")=0,\"Vendido\",\"Disponible\")","v":"Disponible"}]
["Real de Parras","c, parras 97, bosques del pardo, ags","Nor Oriente","Bovedas",null,"Media",3,2,"Block","3 o 4",40,4,null,"Privado","Caseta de vigilancia","Vigilancia 24/7","Si",600,"10",null,null,null,null,1,null,null,null,null,"No","1,2,3,5",15,1,0,20000,"Si","No","oct 22","oct 22",{"$f":"IF(IFERROR(_xlfn.MINIFS(Tabla1012_1[Fecha],Tabla1012_1[Nombre_desarrollo],Tabla2[[#This Row],[Nombre_desarrollo]],Tabla1012_1[Inventario_disponible],0),\"\")>0,IFERROR(_xlfn.MINIFS(Tabla1012_1[Fecha],Tabla1012_1[Nombre_desarrollo],Tabla2[[#This Row],[Nombre_desarrollo]],Tabla1012_1[Inventario_disponible],0),\"\"),\"\")","v":""},{"$f":"IF(AND(Tabla2[[#This Row],[Fecha_inicio_venta]]=\"\",Tabla2[[#This Row],[Fecha_fin_ventas]]<>\"\"),\"Se necesita fecha_inicio_venta\",IF(AND(Tabla2[[#This Row],[Fecha_inicio_venta]]=\"\",Tabla2[[#This Row],[Fecha_fin_ventas]]=\"\"),\"\",IF(AND(Tabla2[[#This Row],[Fecha_inicio_venta]]<>\"\",Tabla2[[#This Row],[Fecha_fin_ventas]]=\"\"),(YEAR(TODAY())-YEAR(Tabla2[[#This Row],[Fecha_inicio_venta]]))*12 + MONTH(TODAY())-MONTH(Tabla2[[#This Row],[Fecha_inicio_venta]]),(YEAR(Tabla2[[#This Row],[Fecha_fin_ventas]])-YEAR(Tabla2[[#This Row],[Fecha_inicio_venta]]))*12 + MONTH(Tabla2[[#This Row],[Fecha_fin_ventas]])-MONTH(Tabla2[[#This Row],[Fecha_inicio_venta]]))))","v":36},null,null,null,null,"",{"$f":"_xlfn.IFS(AND(Tabla2[[#This Row],[Fecha_inicio_construcción]]<>\"\",Tabla2[[#This Row],[Fecha_fin_construcción]]=\"\"),\"En Construcción\",AND(Tabla2[[#This Row],[Fecha_inicio_construcción]]=\"\",Tabla2[[#This Row],[Fecha_fin_construcción]]=\"\"),\"Tierra\",AND(Tabla2[[#This Row],[Fecha_inicio_construcción]]<>\"\",Tabla2[[#This Row],[Fecha_fin_construcción]]<>\"\"),\"Terminado\",AND(Tabla2[[#This Row],[Fecha_fin_construcción]]<>\"\",Tabla2[[#This Row],[Fecha_inicio_construcción]]=\"\"),\"Falta Fecha:inicio:contruccon\")","v":"Tierra"},{"$f":"IF(IFERROR(INDEX(Tabla1012_1[Inventario_disponible],MATCH(1,(Tabla1012_1[Nombre_desarrollo]=Tabla2[[#This Row],[Nombre_desarrollo]])*(Tabla1012_1[Fecha]=_xlfn.MAXIFS(Tabla1012_1[Fecha],Tabla1012_1[Nombre_desarrollo],Tabla2[[#This Row],[Nombre_desarrollo]])),0)),\"\")=0,\"Vendido\",\"Disponible\")","v":"Disponible"}]
["Torre Omega","Av Eugenio Garza Sada, 506, Pocitos, Ags","Nor Poniente","Omega desarrollos",null,"Residencial A",1,1,"Block",9,48,3,null,"Privado","Caseta de vigilancia","Caseta de vigilancia","Si",3500,"3,4,6,7,10,11,19,20,47",null,null,null,null,2,null,null,null,null,"Si","1,2,3,4",30,1,0,30000,"Si","No","JUNIO 23","JUNIO 23",{"$f":"IF(IFERROR(_xlfn.MINIFS(Tabla1012_1[Fecha],Tabla1012_1[Nombre_desarrollo],Tabla2[[#This Row],[Nombre_desarrollo]],Tabla1012_1[Inventario_disponible],0),\"\")>0,IFERROR(_xlfn.MINIFS(Tabla1012_1[Fecha],Tabla1012_1[Nombre_desarrollo],Tabla2[[#This Row],[Nombre_desarrollo]],Tabla1012_1[Inventario_disponible],0),\"\"),\"\")","v":""},{"$f":"IF(AND(Tabla2[[#This Row],[Fecha_inicio_venta]]=\"\",Tabla2[[#This Row],[Fecha_fin_ventas]]<>\"\"),\"Se necesita fecha_inicio_venta\",IF(AND(Tabla2[[#This Row],[Fecha_inicio_venta]]=\"\",Tabla2[[#This Row],[Fecha_fin_ventas]]=\"\"),\"\",IF(AND(Tabla2[[#This Row],[Fecha_inicio_venta]]<>\"\",Tabla2[[#This Row],[Fecha_fin_ventas]]=\"\"),(YEAR(TODAY())-YEAR(Tabla2[[#This Row],[Fecha_inicio_venta]]))*12 + MONTH(TODAY())-MONTH(Tabla2[[#This Row],[Fecha_inicio_venta]]),(YEAR(Tabla2[[#This Row],[Fecha_fin_ventas]])-YEAR(Tabla2[[#This Row],[Fecha_inicio_venta]]))*12 + MONTH(Tabla2[[#This Row],[Fecha_fin_ventas]])-MONTH(Tabla2[[#This Row],[Fecha_inicio_venta]]))))","v":28},null,null,null,null,"",{"$f":"_xlfn.IFS(AND(Tabla2[[#This Row],[Fecha_inicio_construcción]]<>\"\",Tabla2[[#This Row],[Fecha_fin_construcción]]=\"\"),\"En Construcción\",AND(Tabla2[[#This Row],[Fecha_inicio_construcción]]=\"\",Tabla2[[#This Row],[Fecha_fin_construcción]]=\"\"),\"Tierra\",AND(Tabla2[[#This Row],[Fecha_inicio_construcción]]<>\"\",Tabla2[[#This Row],[Fecha_fin_construcción]]<>\"\"),\"Terminado\",AND(Tabla2[[#This Row],[Fecha_fin_construcción]]<>\"\",Tabla2[[#This Row],[Fecha_inicio_construcción]]=\"\"),\"Falta Fecha:inicio:contruccon\")","v":"Tierra"},{"$f":"IF(IFERROR(INDEX(Tabla1012_1[Inventario_disponible],MATCH(1,(Tabla1012_1[Nombre_desarrollo]=Tabla2[[#This Row],[Nombre_desarrollo]])*(Tabla1012_1[Fecha]=_xlfn.MAXIFS(Tabla1012_1[Fecha],Tabla1012_1[Nombre_desarrollo],Tabla2[[#This Row],[Nombre_desarrollo]])),0)),\"\")=0,\"Vendido\",\"Disponible\")","v":"Disponible"}]
["Mazaryk",null,"Poniente","Grupo Aba",null,"Residencial B",1,1,"Block",20,47,4,null,"Privado","Caseta de vigilancia","Vigilancia 24/7","Si",5000,"2,3,6,10,20,23,24,25,30",null,null,null,null,2,null,null,null,null,"Si","1,2,3,5",40,1,0,5000,"Si","No","JULIO23","JULIO23",{"$f":"IF(IFERROR(_xlfn.MINIFS(Tabla1012_1[Fecha],Tabla1012_1[Nombre_desarrollo],Tabla2[[#This Row],[Nombre_desarrollo]],Tabla1012_1[Inventario_disponible],0),\"\")>0,IFERROR(_xlfn.MINIFS(Tabla1012_1[Fecha],Tabla1012_1[Nombre_desarrollo],Tabla2[[#This Row],[Nombre_desarrollo]],Tabla1012_1[Inventario_disponible],0),\"\"),\"\")","v":""},{"$f":"IF(AND(Tabla2[[#This Row],[Fecha_inicio_venta]]=\"\",Tabla2[[#This Row],[Fecha_fin_ventas]]<>\"\"),\"Se necesita fecha_inicio_venta\",IF(AND(Tabla2[[#This Row],[Fecha_inicio_venta]]=\"\",Tabla2[[#This Row],[Fecha_fin_ventas]]=\"\"),\"\",IF(AND(Tabla2[[#This Row],[Fecha_inicio_venta]]<>\"\",Tabla2[[#This Row],[Fecha_fin_ventas]]=\"\"),(YEAR(TODAY())-YEAR(Tabla2[[#This Row],[Fecha_inicio_venta]]))*12 + MONTH(TODAY())-MONTH(Tabla2[[#This Row],[Fecha_inicio_venta]]),(YEAR(Tabla2[[#This Row],[Fecha_fin_ventas]])-YEAR(Tabla2[[#This Row],[Fecha_inicio_venta]]))*12 + MONTH(Tabla2[[#This Row],[Fecha_fin_ventas]])-MONTH(Tabla2[[#This Row],[Fecha_inicio_venta]]))))","v":27},null,null,null,null,"",{"$f":"_xlfn.IFS(AND(Tabla2[[#This Row],[Fecha_inicio_construcción]]<>\"\",Tabla2[[#This Row],[Fecha_fin_construcción]]=\"\"),\"En Construcción\",AND(Tabla2[[#This Row],[Fecha_inicio_construcción]]=\"\",Tabla2[[#This Row],[Fecha_fin_construcción]]=\"\"),\"Tierra\",AND(Tabla2[[#This Row],[Fecha_inicio_construcción]]<>\"\",Tabla2[[#This Row],[Fecha_fin_construcción]]<>\"\"),\"Terminado\",AND(Tabla2[[#This Row],[Fecha_fin_construcción]]<>\"\",Tabla2[[#This Row],[Fecha_inicio_construcción]]=\"\"),\"Falta Fecha:inicio:contruccon\")","v":"Tierra"},{"$f":"IF(IFERROR(INDEX(Tabla1012_1[Inventario_disponible],MATCH(1,(Tabla1012_1[Nombre_desarrollo]=Tabla2[[#This Row],[Nombre_desarrollo]])*(Tabla1012_1[Fecha]=_xlfn.MAXIFS(Tabla1012_1[Fecha],Tabla1012_1[Nombre_desarrollo],Tabla2[[#This Row],[Nombre_desarrollo]])),0)),\"\")=0,\"Vendido\",\"Disponible\")","v":"Disponible"}]
["Reserva Quetzales Torre 2","Carretera la Guayana, San Francisco de los Romos","Nor Oriente","Grupo San Cristobal",null,null,3,2,"Block",null,6,3,null,"Privado","Caseta de vigilancia","Caseta de vigilancia","Si",350,"1,2,3,19","Área de juegos infantiles.",null,null,null,1,null,null,null,null,"Si","1,2,3",0.1,1,0,5000,"No","No","dic 23","dic 23",{"$f":"IF(IFERROR(_xlfn.MINIFS(Tabla1012_1[Fecha],Tabla1012_1[Nombre_desarrollo],Tabla2[[#This Row],[Nombre_desarrollo]],Tabla1012_1[Inventario_disponible],0),\"\")>0,IFERROR(_xlfn.MINIFS(Tabla1012_1[Fecha],Tabla1012_1[Nombre_desarrollo],Tabla2[[#This Row],[Nombre_desarrollo]],Tabla1012_1[Inventario_disponible],0),\"\"),\"\")","v":""},{"$f":"IF(AND(Tabla2[[#This Row],[Fecha_inicio_venta]]=\"\",Tabla2[[#This Row],[Fecha_fin_ventas]]<>\"\"),\"Se necesita fecha_inicio_venta\",IF(AND(Tabla2[[#This Row],[Fecha_inicio_venta]]=\"\",Tabla2[[#This Row],[Fecha_fin_ventas]]=\"\"),\"\",IF(AND(Tabla2[[#This Row],[Fecha_inicio_venta]]<>\"\",Tabla2[[#This Row],[Fecha_fin_ventas]]=\"\"),(YEAR(TODAY())-YEAR(Tabla2[[#This Row],[Fecha_inicio_venta]]))*12 + MONTH(TODAY())-MONTH(Tabla2[[#This Row],[Fecha_inicio_venta]]),(YEAR(Tabla2[[#This Row],[Fecha_fin_ventas]])-YEAR(Tabla2[[#This Row],[Fecha_inicio_venta]]))*12 + MONTH(Tabla2[[#This Row],[Fecha_fin_ventas]])-MONTH(Tabla2[[#This Row],[Fecha_inicio_venta]]))))","v":22},"2023-12-01",null,null,null,"",{"$f":"_xlfn.IFS(AND(Tabla2[[#This Row],[Fecha_inicio_construcción]]<>\"\",Tabla2[[#This Row],[Fecha_fin_construcción]]=\"\"),\"En Construcción\",AND(Tabla2[[#This Row],[Fecha_inicio_construcción]]=\"\",Tabla2[[#This Row],[Fecha_fin_construcción]]=\"\"),\"Tierra\",AND(Tabla2[[#This Row],[Fecha_inicio_construcción]]<>\"\",Tabla2[[#This Row],[Fecha_fin_construcción]]<>\"\"),\"Terminado\",AND(Tabla2[[#This Row],[Fecha_fin_construcción]]<>\"\",Tabla2[[#This Row],[Fecha_inicio_construcción]]=\"\"),\"Falta Fecha:inicio:contruccon\")","v":"Tierra"},{"$f":"IF(IFERROR(INDEX(Tabla1012_1[Inventario_disponible],MATCH(1,(Tabla1012_1[Nombre_desarrollo]=Tabla2[[#This Row],[Nombre_desarrollo]])*(Tabla1012_1[Fecha]=_xlfn.MAXIFS(Tabla1012_1[Fecha],Tabla1012_1[Nombre_desarrollo],Tabla2[[#This Row],[Nombre_desarrollo]])),0)),\"\")=0,\"Vendido\",\"Disponible\")","v":"Disponible"}]
["Reserva Quetzales Torre 3","Carretera la Guayana, San Francisco de los Romos","Nor Oriente","Grupo San Cristobal",null,"Media",3,3,"Block",null,6,3,null,"Privado","Caseta de vigilancia","Caseta de vigilancia","Si",350,"1,2,3,19","Área de juegos infantiles.",null,null,null,1,null,null,null,null,"Si","1,2,3",0.1,1,0,5000,"No","No","dic 23","dic 23",{"$f":"IF(IFERROR(_xlfn.MINIFS(Tabla1012_1[Fecha],Tabla1012_1[Nombre_desarrollo],Tabla2[[#This Row],[Nombre_desarrollo]],Tabla1012_1[Inventario_disponible],0),\"\")>0,IFERROR(_xlfn.MINIFS(Tabla1012_1[Fecha],Tabla1012_1[Nombre_desarrollo],Tabla2[[#This Row],[Nombre_desarrollo]],Tabla1012_1[Inventario_disponible],0),\"\"),\"\")","v":""},{"$f":"IF(AND(Tabla2[[#This Row],[Fecha_inicio_venta]]=\"\",Tabla2[[#This Row],[Fecha_fin_ventas]]<>\"\"),\"Se necesita fecha_inicio_venta\",IF(AND(Tabla2[[#This Row],[Fecha_inicio_venta]]=\"\",Tabla2[[#This Row],[Fecha_fin_ventas]]=\"\"),\"\",IF(AND(Tabla2[[#This Row],[Fecha_inicio_venta]]<>\"\",Tabla2[[#This Row],[Fecha_fin_ventas]]=\"\"),(YEAR(TODAY())-YEAR(Tabla2[[#This Row],[Fecha_inicio_venta]]))*12 + MONTH(TODAY())-MONTH(Tabla2[[#This Row],[Fecha_inicio_venta]]),(YEAR(Tabla2[[#This Row],[Fecha_fin_ventas]])-YEAR(Tabla2[[#This Row],[Fecha_inicio_venta]]))*12 + MONTH(Tabla2[[#This Row],[Fecha_fin_ventas]])-MONTH(Tabla2[[#This Row],[Fecha_inicio_venta]]))))","v":22},"2023-12-01",null,null,null,"",{"$f":"_xlfn.IFS(AND(Tabla2[[#This Row],[Fecha_inicio_construcción]]<>\"\",Tabla2[[#This Row],[Fecha_fin_construcción]]=\"\"),\"En Construcción\",AND(Tabla2[[#This Row],[Fecha_inicio_construcción]]=\"\",Tabla2[[#This Row],[Fecha_fin_construcción]]=\"\"),\"Tierra\",AND(Tabla2[[#This Row],[Fecha_inicio_construcción]]<>\"\",Tabla2[[#This Row],[Fecha_fin_construcción]]<>\"\"),\"Terminado\",AND(Tabla2[[#This Row],[Fecha_fin_construcción]]<>\"\",Tabla2[[#This Row],[Fecha_inicio_construcción]]=\"\"),\"Falta Fecha:inicio:contruccon\")","v":"Tierra"},{"$f":"IF(IFERROR(INDEX(Tabla1012_1[Inventario_disponible],MATCH(1,(Tabla1012_1[Nombre_desarrollo]=Tabla2[[#This Row],[Nombre_desarrollo]])*(Tabla1012_1[Fecha]=_xlfn.MAXIFS(Tabla1012_1[Fecha],Tabla1012_1[Nombre_desarrollo],Tabla2[[#This Row],[Nombre_desarrollo]])),0)),\"\")=0,\"Vendido\",\"Disponible\")","v":"Disponible"}]
["Torre Beara- Torre 3","Av. Guadalupe Gonzales #1111","Nor Poniente","Terralta",null,"Residencial A",3,3,"Ladrillo",null,48,4,null,"Privado","Caseta de Vigilancia","Caseta de vigilancia","Si","$30.00 m2","2,20","Garden Lounge",null,null,null,1,null,null,null,null,"No","3",15,1,0,50000,"Si","No","nov 23","nov 23",{"$f":"IF(IFERROR(_xlfn.MINIFS(Tabla1012_1[Fecha],Tabla1012_1[Nombre_desarrollo],Tabla2[[#This Row],[Nombre_desarrollo]],Tabla1012_1[Inventario_disponible],0),\"\")>0,IFERROR(_xlfn.MINIFS(Tabla1012_1[Fecha],Tabla1012_1[Nombre_desarrollo],Tabla2[[#This Row],[Nombre_desarrollo]],Tabla1012_1[Inventario_disponible],0),\"\"),\"\")","v":""},{"$f":"IF(AND(Tabla2[[#This Row],[Fecha_inicio_venta]]=\"\",Tabla2[[#This Row],[Fecha_fin_ventas]]<>\"\"),\"Se necesita fecha_inicio_venta\",IF(AND(Tabla2[[#This Row],[Fecha_inicio_venta]]=\"\",Tabla2[[#This Row],[Fecha_fin_ventas]]=\"\"),\"\",IF(AND(Tabla2[[#This Row],[Fecha_inicio_venta]]<>\"\",Tabla2[[#This Row],[Fecha_fin_ventas]]=\"\"),(YEAR(TODAY())-YEAR(Tabla2[[#This Row],[Fecha_inicio_venta]]))*12 + MONTH(TODAY())-MONTH(Tabla2[[#This Row],[Fecha_inicio_venta]]),(YEAR(Tabla2[[#This Row],[Fecha_fin_ventas]])-YEAR(Tabla2[[#This Row],[Fecha_inicio_venta]]))*12 + MONTH(Tabla2[[#This Row],[Fecha_fin_ventas]])-MONTH(Tabla2[[#This Row],[Fecha_inicio_venta]]))))","v":23},"2024-03-26",null,null,null,"",{"$f":"_xlfn.IFS(AND(Tabla2[[#This Row],[Fecha_inicio_construcción]]<>\"\",Tabla2[[#This Row],[Fecha_fin_construcción]]=\"\"),\"En Construcción\",AND(Tabla2[[#This Row],[Fecha_inicio_construcción]]=\"\",Tabla2[[#This Row],[Fecha_fin_construcción]]=\"\"),\"Tierra\",AND(Tabla2[[#This Row],[Fecha_inicio_construcción]]<>\"\",Tabla2[[#This Row],[Fecha_fin_construcción]]<>\"\"),\"Terminado\",AND(Tabla2[[#This Row],[Fecha_fin_construcción]]<>\"\",Tabla2[[#This Row],[Fecha_inicio_construcción]]=\"\"),\"Falta Fecha:inicio:contruccon\")","v":"Tierra"},{"$f":"IF(IFERROR(INDEX(Tabla1012_1[Inventario_disponible],MATCH(1,(Tabla1012_1[Nombre_desarrollo]=Tabla2[[#This Row],[Nombre_desarrollo]])*(Tabla1012_1[Fecha]=_xlfn.MAXIFS(Tabla1012_1[Fecha],Tabla1012_1[Nombre_desarrollo],Tabla2[[#This Row],[Nombre_desarrollo]])),0)),\"\")=0,\"Vendido\",\"Disponible\")","v":"Disponible"}]
["Valtica Torre",null,"Norte","Plusvalterra",null,"Residencial A",1,1,"Block",null,16,4,null,"Privado","Caseta de vigilancia","Caseta de vigilancia","si","1000 a 1100","1,2,3,4,20,24,47",null,null,null,null,1,null,null,null,null,"Si","1,2,3,5",40,1,0,20000,"Si","No","enero 24","enero 24",{"$f":"IF(IFERROR(_xlfn.MINIFS(Tabla1012_1[Fecha],Tabla1012_1[Nombre_desarrollo],Tabla2[[#This Row],[Nombre_desarrollo]],Tabla1012_1[Inventario_disponible],0),\"\")>0,IFERROR(_xlfn.MINIFS(Tabla1012_1[Fecha],Tabla1012_1[Nombre_desarrollo],Tabla2[[#This Row],[Nombre_desarrollo]],Tabla1012_1[Inventario_disponible],0),\"\"),\"\")","v":""},{"$f":"IF(AND(Tabla2[[#This Row],[Fecha_inicio_venta]]=\"\",Tabla2[[#This Row],[Fecha_fin_ventas]]<>\"\"),\"Se necesita fecha_inicio_venta\",IF(AND(Tabla2[[#This Row],[Fecha_inicio_venta]]=\"\",Tabla2[[#This Row],[Fecha_fin_ventas]]=\"\"),\"\",IF(AND(Tabla2[[#This Row],[Fecha_inicio_venta]]<>\"\",Tabla2[[#This Row],[Fecha_fin_ventas]]=\"\"),(YEAR(TODAY())-YEAR(Tabla2[[#This Row],[Fecha_inicio_venta]]))*12 + MONTH(TODAY())-MONTH(Tabla2[[#This Row],[Fecha_inicio_venta]]),(YEAR(Tabla2[[#This Row],[Fecha_fin_ventas]])-YEAR(Tabla2[[#This Row],[Fecha_inicio_venta]]))*12 + MONTH(Tabla2[[#This Row],[Fecha_fin_ventas]])-MONTH(Tabla2[[#This Row],[Fecha_inicio_venta]]))))","v":21},null,null,null,null,"",{"$f":"_xlfn.IFS(AND(Tabla2[[#This Row],[Fecha_inicio_construcción]]<>\"\",Tabla2[[#This Row],[Fecha_fin_construcción]]=\"\"),\"En Construcción\",AND(Tabla2[[#This Row],[Fecha_inicio_construcción]]=\"\",Tabla2[[#This Row],[Fecha_fin_construcción]]=\"\"),\"Tierra\",AND(Tabla2[[#This Row],[Fecha_inicio_construcción]]<>\"\",Tabla2[[#This Row],[Fecha_fin_construcción]]<>\"\"),\"Terminado\",AND(Tabla2[[#This Row],[Fecha_fin_construcción]]<>\"\",Tabla2[[#This Row],[Fecha_inicio_construcción]]=\"\"),\"Falta Fecha:inicio:contruccon\")","v":"Tierra"},{"$f":"IF(IFERROR(INDEX(Tabla1012_1[Inventario_disponible],MATCH(1,(Tabla1012_1[Nombre_desarrollo]=Tabla2[[#This Row],[Nombre_desarrollo]])*(Tabla1012_1[Fecha]=_xlfn.MAXIFS(Tabla1012_1[Fecha],Tabla1012_1[Nombre_desarrollo],Tabla2[[#This Row],[Nombre_desarrollo]])),0)),\"\")=0,\"Vendido\",\"Disponible\")","v":"Disponible"}]
["Torre Nogales",null,"Jesús Maria","Grupo Homme",null,"Residencial A",1,1,"Ladrillo",5,30,3,null,"Privado","Caseta de vigilancia","Videovigilancia y seguridad 24/7","Si",650,"1,2,3,4",null,null,null,null,1,null,null,null,null,"SI","1,2,3,5",10,1,0,20000,"Si","No","marzo 24","marzo 24",{"$f":"IF(IFERROR(_xlfn.MINIFS(Tabla1012_1[Fecha],Tabla1012_1[Nombre_desarrollo],Tabla2[[#This Row],[Nombre_desarrollo]],Tabla1012_1[Inventario_disponible],0),\"\")>0,IFERROR(_xlfn.MINIFS(Tabla1012_1[Fecha],Tabla1012_1[Nombre_desarrollo],Tabla2[[#This Row],[Nombre_desarrollo]],Tabla1012_1[Inventario_disponible],0),\"\"),\"\")","v":""},{"$f":"IF(AND(Tabla2[[#This Row],[Fecha_inicio_venta]]=\"\",Tabla2[[#This Row],[Fecha_fin_ventas]]<>\"\"),\"Se necesita fecha_inicio_venta\",IF(AND(Tabla2[[#This Row],[Fecha_inicio_venta]]=\"\",Tabla2[[#This Row],[Fecha_fin_ventas]]=\"\"),\"\",IF(AND(Tabla2[[#This Row],[Fecha_inicio_venta]]<>\"\",Tabla2[[#This Row],[Fecha_fin_ventas]]=\"\"),(YEAR(TODAY())-YEAR(Tabla2[[#This Row],[Fecha_inicio_venta]]))*12 + MONTH(TODAY())-MONTH(Tabla2[[#This Row],[Fecha_inicio_venta]]),(YEAR(Tabla2[[#This Row],[Fecha_fin_ventas]])-YEAR(Tabla2[[#This Row],[Fecha_inicio_venta]]))*12 + MONTH(Tabla2[[#This Row],[Fecha_fin_ventas]])-MONTH(Tabla2[[#This Row],[Fecha_inicio_venta]]))))","v":19},null,null,null,null,"",{"$f":"_xlfn.IFS(AND(Tabla2[[#This Row],[Fecha_inicio_construcción]]<>\"\",Tabla2[[#This Row],[Fecha_fin_construcción]]=\"\"),\"En Construcción\",AND(Tabla2[[#This Row],[Fecha_inicio_construcción]]=\"\",Tabla2[[#This Row],[Fecha_fin_construcción]]=\"\"),\"Tierra\",AND(Tabla2[[#This Row],[Fecha_inicio_construcción]]<>\"\",Tabla2[[#This Row],[Fecha_fin_construcción]]<>\"\"),\"Terminado\",AND(Tabla2[[#This Row],[Fecha_fin_construcción]]<>\"\",Tabla2[[#This Row],[Fecha_inicio_construcción]]=\"\"),\"Falta Fecha:inicio:contruccon\")","v":"Tierra"},{"$f":"IF(IFERROR(INDEX(Tabla1012_1[Inventario_disponible],MATCH(1,(Tabla1012_1[Nombre_desarrollo]=Tabla2[[#This Row],[Nombre_desarrollo]])*(Tabla1012_1[Fecha]=_xlfn.MAXIFS(Tabla1012_1[Fecha],Tabla1012_1[Nombre_desarrollo],Tabla2[[#This Row],[Nombre_desarrollo]])),0)),\"\")=0,\"Vendido\",\"Disponible\")","v":"Disponible"}]
["Torre Mezquital",null,"Jesús Maria","Grupo Homme",null,"Media",1,1,"Ladrillo",6,20,3,null,"Privado","Caseta de vigilancia","Videovigilancia y seguridad 24/7","Si",650,"1,2,3,4",null,null,null,null,1,null,null,null,null,"SI","1,2,3,4,5",20,0,7,30000,"Si","No","Marzo 2024","Marzo 2024",{"$f":"IF(IFERROR(_xlfn.MINIFS(Tabla1012_1[Fecha],Tabla1012_1[Nombre_desarrollo],Tabla2[[#This Row],[Nombre_desarrollo]],Tabla1012_1[Inventario_disponible],0),\"\")>0,IFERROR(_xlfn.MINIFS(Tabla1012_1[Fecha],Tabla1012_1[Nombre_desarrollo],Tabla2[[#This Row],[Nombre_desarrollo]],Tabla1012_1[Inventario_disponible],0),\"\"),\"\")","v":""},{"$f":"IF(AND(Tabla2[[#This Row],[Fecha_inicio_venta]]=\"\",Tabla2[[#This Row],[Fecha_fin_ventas]]<>\"\"),\"Se necesita fecha_inicio_venta\",IF(AND(Tabla2[[#This Row],[Fecha_inicio_venta]]=\"\",Tabla2[[#This Row],[Fecha_fin_ventas]]=\"\"),\"\",IF(AND(Tabla2[[#This Row],[Fecha_inicio_venta]]<>\"\",Tabla2[[#This Row],[Fecha_fin_ventas]]=\"\"),(YEAR(TODAY())-YEAR(Tabla2[[#This Row],[Fecha_inicio_venta]]))*12 + MONTH(TODAY())-MONTH(Tabla2[[#This Row],[Fecha_inicio_venta]]),(YEAR(Tabla2[[#This Row],[Fecha_fin_ventas]])-YEAR(Tabla2[[#This Row],[Fecha_inicio_venta]]))*12 + MONTH(Tabla2[[#This Row],[Fecha_fin_ventas]])-MONTH(Tabla2[[#This Row],[Fecha_inicio_venta]]))))","v":19},null,null,null,null,"",{"$f":"_xlfn.IFS(AND(Tabla2[[#This Row],[Fecha_inicio_construcción]]<>\"\",Tabla2[[#This Row],[Fecha_fin_construcción]]=\"\"),\"En Construcción\",AND(Tabla2[[#This Row],[Fecha_inicio_construcción]]=\"\",Tabla2[[#This Row],[Fecha_fin_construcción]]=\"\"),\"Tierra\",AND(Tabla2[[#This Row],[Fecha_inicio_construcción]]<>\"\",Tabla2[[#This Row],[Fecha_fin_construcción]]<>\"\"),\"Terminado\",AND(Tabla2[[#This Row],[Fecha_fin_construcción]]<>\"\",Tabla2[[#This Row],[Fecha_inicio_construcción]]=\"\"),\"Falta Fecha:inicio:contruccon\")","v":"Tierra"},{"$f":"IF(IFERROR(INDEX(Tabla1012_1[Inventario_disponible],MATCH(1,(Tabla1012_1[Nombre_desarrollo]=Tabla2[[#This Row],[Nombre_desarrollo]])*(Tabla1012_1[Fecha]=_xlfn.MAXIFS(Tabla1012_1[Fecha],Tabla1012_1[Nombre_desarrollo],Tabla2[[#This Row],[Nombre_desarrollo]])),0)),\"\")=0,\"Vendido\",\"Disponible\")","v":"Disponible"}]
["Verona Torres 2",null,"Sur Poniente","Grupo San Cristobal",null,"Media",1,1,"Block",0,12,3,null,"Privado","Caseta de vigilancia","Caseta de vigilancia","Si",450,"1,2,3,19","Área de juegos infantiles.",null,null,null,1,null,null,null,null,"Si","1,2,3",0.1,1,0,5000,"No","No","junio 2024","junio 2024",{"$f":"IF(IFERROR(_xlfn.MINIFS(Tabla1012_1[Fecha],Tabla1012_1[Nombre_desarrollo],Tabla2[[#This Row],[Nombre_desarrollo]],Tabla1012_1[Inventario_disponible],0),\"\")>0,IFERROR(_xlfn.MINIFS(Tabla1012_1[Fecha],Tabla1012_1[Nombre_desarrollo],Tabla2[[#This Row],[Nombre_desarrollo]],Tabla1012_1[Inventario_disponible],0),\"\"),\"\")","v":""},{"$f":"IF(AND(Tabla2[[#This Row],[Fecha_inicio_venta]]=\"\",Tabla2[[#This Row],[Fecha_fin_ventas]]<>\"\"),\"Se necesita fecha_inicio_venta\",IF(AND(Tabla2[[#This Row],[Fecha_inicio_venta]]=\"\",Tabla2[[#This Row],[Fecha_fin_ventas]]=\"\"),\"\",IF(AND(Tabla2[[#This Row],[Fecha_inicio_venta]]<>\"\",Tabla2[[#This Row],[Fecha_fin_ventas]]=\"\"),(YEAR(TODAY())-YEAR(Tabla2[[#This Row],[Fecha_inicio_venta]]))*12 + MONTH(TODAY())-MONTH(Tabla2[[#This Row],[Fecha_inicio_venta]]),(YEAR(Tabla2[[#This Row],[Fecha_fin_ventas]])-YEAR(Tabla2[[#This Row],[Fecha_inicio_venta]]))*12 + MONTH(Tabla2[[#This Row],[Fecha_fin_ventas]])-MONTH(Tabla2[[#This Row],[Fecha_inicio_venta]]))))","v":16},null,null,null,null,"",{"$f":"_xlfn.IFS(AND(Tabla2[[#This Row],[Fecha_inicio_construcción]]<>\"\",Tabla2[[#This Row],[Fecha_fin_construcción]]=\"\"),\"En Construcción\",AND(Tabla2[[#This Row],[Fecha_inicio_construcción]]=\"\",Tabla2[[#This Row],[Fecha_fin_construcción]]=\"\"),\"Tierra\",AND(Tabla2[[#This Row],[Fecha_inicio_construcción]]<>\"\",Tabla2[[#This Row],[Fecha_fin_construcción]]<>\"\"),\"Terminado\",AND(Tabla2[[#This Row],[Fecha_fin_construcción]]<>\"\",Tabla2[[#This Row],[Fecha_inicio_construcción]]=\"\"),\"Falta Fecha:inicio:contruccon\")","v":"Tierra"},{"$f":"IF(IFERROR(INDEX(Tabla1012_1[Inventario_disponible],MATCH(1,(Tabla1012_1[Nombre_desarrollo]=Tabla2[[#This Row],[Nombre_desarrollo]])*(Tabla1012_1[Fecha]=_xlfn.MAXIFS(Tabla1012_1[Fecha],Tabla1012_1[Nombre_desarrollo],Tabla2[[#This Row],[Nombre_desarrollo]])),0)),\"\")=0,\"Vendido\",\"Disponible\")","v":"Disponible"}]
["kamorebi Torres",null,"Sur Poniente","Grupo San Cristobal",null,"Media",1,1,"Block",0,72,3,null,"Privado","Caseta de vigilancia","Caseta de vigilancia","Si",450,"1,2,3,19","Área de juegos infantiles.",null,null,null,1,null,null,null,null,"Si","1,2,3",0.1,1,0,5000,"No","No","junio 2024","junio 2024",{"$f":"IF(IFERROR(_xlfn.MINIFS(Tabla1012_1[Fecha],Tabla1012_1[Nombre_desarrollo],Tabla2[[#This Row],[Nombre_desarrollo]],Tabla1012_1[Inventario_disponible],0),\"\")>0,IFERROR(_xlfn.MINIFS(Tabla1012_1[Fecha],Tabla1012_1[Nombre_desarrollo],Tabla2[[#This Row],[Nombre_desarrollo]],Tabla1012_1[Inventario_disponible],0),\"\"),\"\")","v":""},{"$f":"IF(AND(Tabla2[[#This Row],[Fecha_inicio_venta]]=\"\",Tabla2[[#This Row],[Fecha_fin_ventas]]<>\"\"),\"Se necesita fecha_inicio_venta\",IF(AND(Tabla2[[#This Row],[Fecha_inicio_venta]]=\"\",Tabla2[[#This Row],[Fecha_fin_ventas]]=\"\"),\"\",IF(AND(Tabla2[[#This Row],[Fecha_inicio_venta]]<>\"\",Tabla2[[#This Row],[Fecha_fin_ventas]]=\"\"),(YEAR(TODAY())-YEAR(Tabla2[[#This Row],[Fecha_inicio_venta]]))*12 + MONTH(TODAY())-MONTH(Tabla2[[#This Row],[Fecha_inicio_venta]]),(YEAR(Tabla2[[#This Row],[Fecha_fin_ventas]])-YEAR(Tabla2[[#This Row],[Fecha_inicio_venta]]))*12 + MONTH(Tabla2[[#This Row],[Fecha_fin_ventas]])-MONTH(Tabla2[[#This Row],[Fecha_inicio_venta]]))))","v":16},null,null,null,null,"",{"$f":"_xlfn.IFS(AND(Tabla2[[#This Row],[Fecha_inicio_construcción]]<>\"\",Tabla2[[#This Row],[Fecha_fin_construcción]]=\"\"),\"En Construcción\",AND(Tabla2[[#This Row],[Fecha_inicio_construcción]]=\"\",Tabla2[[#This Row],[Fecha_fin_construcción]]=\"\"),\"Tierra\",AND(Tabla2[[#This Row],[Fecha_inicio_construcción]]<>\"\",Tabla2[[#This Row],[Fecha_fin_construcción]]<>\"\"),\"Terminado\",AND(Tabla2[[#This Row],[Fecha_fin_construcción]]<>\"\",Tabla2[[#This Row],[Fecha_inicio_construcción]]=\"\"),\"Falta Fecha:inicio:contruccon\")","v":"Tierra"},{"$f":"IF(IFERROR(INDEX(Tabla1012_1[Inventario_disponible],MATCH(1,(Tabla1012_1[Nombre_desarrollo]=Tabla2[[#This Row],[Nombre_desarrollo]])*(Tabla1012_1[Fecha]=_xlfn.MAXIFS(Tabla1012_1[Fecha],Tabla1012_1[Nombre_desarrollo],Tabla2[[#This Row],[Nombre_desarrollo]])),0)),\"\")=0,\"Vendido\",\"Disponible\")","v":"Disponible"}]
["Sierra Morena 415","Sierra Morena 415 , Bosques del Prado, Ags.","Norte","AVENTUS",null,"Residencial B",1,1,"Block",0,11,11,null,"Privado","Caseta de vigilancia","caseta controlada con biometrico y reconocimiento facial, videovigilancia 24/7","Si",2000,"1,2,3,4,6,7,9,10,11,17,19,20,23,24,30",null,null,null,null,2,null,null,null,null,"Si","1,2,3,4",20,1,0,500000,"Si","No","Octubre 2024","Octubre 2024",{"$f":"IF(IFERROR(_xlfn.MINIFS(Tabla1012_1[Fecha],Tabla1012_1[Nombre_desarrollo],Tabla2[[#This Row],[Nombre_desarrollo]],Tabla1012_1[Inventario_disponible],0),\"\")>0,IFERROR(_xlfn.MINIFS(Tabla1012_1[Fecha],Tabla1012_1[Nombre_desarrollo],Tabla2[[#This Row],[Nombre_desarrollo]],Tabla1012_1[Inventario_disponible],0),\"\"),\"\")","v":""},{"$f":"IF(AND(Tabla2[[#This Row],[Fecha_inicio_venta]]=\"\",Tabla2[[#This Row],[Fecha_fin_ventas]]<>\"\"),\"Se necesita fecha_inicio_venta\",IF(AND(Tabla2[[#This Row],[Fecha_inicio_venta]]=\"\",Tabla2[[#This Row],[Fecha_fin_ventas]]=\"\"),\"\",IF(AND(Tabla2[[#This Row],[Fecha_inicio_venta]]<>\"\",Tabla2[[#This Row],[Fecha_fin_ventas]]=\"\"),(YEAR(TODAY())-YEAR(Tabla2[[#This Row],[Fecha_inicio_venta]]))*12 + MONTH(TODAY())-MONTH(Tabla2[[#This Row],[Fecha_inicio_venta]]),(YEAR(Tabla2[[#This Row],[Fecha_fin_ventas]])-YEAR(Tabla2[[#This Row],[Fecha_inicio_venta]]))*12 + MONTH(Tabla2[[#This Row],[Fecha_fin_ventas]])-MONTH(Tabla2[[#This Row],[Fecha_inicio_venta]]))))","v":12},null,null,null,null,"",{"$f":"_xlfn.IFS(AND(Tabla2[[#This Row],[Fecha_inicio_construcción]]<>\"\",Tabla2[[#This Row],[Fecha_fin_construcción]]=\"\"),\"En Construcción\",AND(Tabla2[[#This Row],[Fecha_inicio_construcción]]=\"\",Tabla2[[#This Row],[Fecha_fin_construcción]]=\"\"),\"Tierra\",AND(Tabla2[[#This Row],[Fecha_inicio_construcción]]<>\"\",Tabla2[[#This Row],[Fecha_fin_construcción]]<>\"\"),\"Terminado\",AND(Tabla2[[#This Row],[Fecha_fin_construcción]]<>\"\",Tabla2[[#This Row],[Fecha_inicio_construcción]]=\"\"),\"Falta Fecha:inicio:contruccon\")","v":"Tierra"},{"$f":"IF(IFERROR(INDEX(Tabla1012_1[Inventario_disponible],MATCH(1,(Tabla1012_1[Nombre_desarrollo]=Tabla2[[#This Row],[Nombre_desarrollo]])*(Tabla1012_1[Fecha]=_xlfn.MAXIFS(Tabla1012_1[Fecha],Tabla1012_1[Nombre_desarrollo],Tabla2[[#This Row],[Nombre_desarrollo]])),0)),\"\")=0,\"Vendido\",\"Disponible\")","v":"Disponible"}]
["GTO 211","Guanajuato 211. Residencial del Valle, Ags","Poniente","DENOBLACK",null,null,1,1,"-",3,12,3,null,"Privado","Porton electrico controlado por tarjeta","Porton electrico",null,1450,"",null,null,null,null,1,null,null,null,null,"Si","1,3,4,5",0.3,1,0,20000,"si","no","abril 25","abril 25",{"$f":"IF(IFERROR(_xlfn.MINIFS(Tabla1012_1[Fecha],Tabla1012_1[Nombre_desarrollo],Tabla2[[#This Row],[Nombre_desarrollo]],Tabla1012_1[Inventario_disponible],0),\"\")>0,IFERROR(_xlfn.MINIFS(Tabla1012_1[Fecha],Tabla1012_1[Nombre_desarrollo],Tabla2[[#This Row],[Nombre_desarrollo]],Tabla1012_1[Inventario_disponible],0),\"\"),\"\")","v":""},{"$f":"IF(AND(Tabla2[[#This Row],[Fecha_inicio_venta]]=\"\",Tabla2[[#This Row],[Fecha_fin_ventas]]<>\"\"),\"Se necesita fecha_inicio_venta\",IF(AND(Tabla2[[#This Row],[Fecha_inicio_venta]]=\"\",Tabla2[[#This Row],[Fecha_fin_ventas]]=\"\"),\"\",IF(AND(Tabla2[[#This Row],[Fecha_inicio_venta]]<>\"\",Tabla2[[#This Row],[Fecha_fin_ventas]]=\"\"),(YEAR(TODAY())-YEAR(Tabla2[[#This Row],[Fecha_inicio_venta]]))*12 + MONTH(TODAY())-MONTH(Tabla2[[#This Row],[Fecha_inicio_venta]]),(YEAR(Tabla2[[#This Row],[Fecha_fin_ventas]])-YEAR(Tabla2[[#This Row],[Fecha_inicio_venta]]))*12 + MONTH(Tabla2[[#This Row],[Fecha_fin_ventas]])-MONTH(Tabla2[[#This Row],[Fecha_inicio_venta]]))))","v":6},null,null,null,null,"",{"$f":"_xlfn.IFS(AND(Tabla2[[#This Row],[Fecha_inicio_construcción]]<>\"\",Tabla2[[#This Row],[Fecha_fin_construcción]]=\"\"),\"En Construcción\",AND(Tabla2[[#This Row],[Fecha_inicio_construcción]]=\"\",Tabla2[[#This Row],[Fecha_fin_construcción]]=\"\"),\"Tierra\",AND(Tabla2[[#This Row],[Fecha_inicio_construcción]]<>\"\",Tabla2[[#This Row],[Fecha_fin_construcción]]<>\"\"),\"Terminado\",AND(Tabla2[[#This Row],[Fecha_fin_construcción]]<>\"\",Tabla2[[#This Row],[Fecha_inicio_construcción]]=\"\"),\"Falta Fecha:inicio:contruccon\")","v":"Tierra"},{"$f":"IF(IFERROR(INDEX(Tabla1012_1[Inventario_disponible],MATCH(1,(Tabla1012_1[Nombre_desarrollo]=Tabla2[[#This Row],[Nombre_desarrollo]])*(Tabla1012_1[Fecha]=_xlfn.MAXIFS(Tabla1012_1[Fecha],Tabla1012_1[Nombre_desarrollo],Tabla2[[#This Row],[Nombre_desarrollo]])),0)),\"\")=0,\"Vendido\",\"Disponible\")","v":"Disponible"}]
["Cholula 665 ","larreategui 665","Centro","AAFECO",null,null,2,1,"tabique",0,6,3,null,"Privado","Caseta de vigilancia",null,"Si",null,"",null,null,null,null,1,null,null,null,null,"Si","1,2,3,4",20,1,0,20000,"Si","No","enero 25","enero 25",{"$f":"IF(IFERROR(_xlfn.MINIFS(Tabla1012_1[Fecha],Tabla1012_1[Nombre_desarrollo],Tabla2[[#This Row],[Nombre_desarrollo]],Tabla1012_1[Inventario_disponible],0),\"\")>0,IFERROR(_xlfn.MINIFS(Tabla1012_1[Fecha],Tabla1012_1[Nombre_desarrollo],Tabla2[[#This Row],[Nombre_desarrollo]],Tabla1012_1[Inventario_disponible],0),\"\"),\"\")","v":""},{"$f":"IF(AND(Tabla2[[#This Row],[Fecha_inicio_venta]]=\"\",Tabla2[[#This Row],[Fecha_fin_ventas]]<>\"\"),\"Se necesita fecha_inicio_venta\",IF(AND(Tabla2[[#This Row],[Fecha_inicio_venta]]=\"\",Tabla2[[#This Row],[Fecha_fin_ventas]]=\"\"),\"\",IF(AND(Tabla2[[#This Row],[Fecha_inicio_venta]]<>\"\",Tabla2[[#This Row],[Fecha_fin_ventas]]=\"\"),(YEAR(TODAY())-YEAR(Tabla2[[#This Row],[Fecha_inicio_venta]]))*12 + MONTH(TODAY())-MONTH(Tabla2[[#This Row],[Fecha_inicio_venta]]),(YEAR(Tabla2[[#This Row],[Fecha_fin_ventas]])-YEAR(Tabla2[[#This Row],[Fecha_inicio_venta]]))*12 + MONTH(Tabla2[[#This Row],[Fecha_fin_ventas]])-MONTH(Tabla2[[#This Row],[Fecha_inicio_venta]]))))","v":9},null,null,null,null,"",{"$f":"_xlfn.IFS(AND(Tabla2[[#This Row],[Fecha_inicio_construcción]]<>\"\",Tabla2[[#This Row],[Fecha_fin_construcción]]=\"\"),\"En Construcción\",AND(Tabla2[[#This Row],[Fecha_inicio_construcción]]=\"\",Tabla2[[#This Row],[Fecha_fin_construcción]]=\"\"),\"Tierra\",AND(Tabla2[[#This Row],[Fecha_inicio_construcción]]<>\"\",Tabla2[[#This Row],[Fecha_fin_construcción]]<>\"\"),\"Terminado\",AND(Tabla2[[#This Row],[Fecha_fin_construcción]]<>\"\",Tabla2[[#This Row],[Fecha_inicio_construcción]]=\"\"),\"Falta Fecha:inicio:contruccon\")","v":"Tierra"},{"$f":"IF(IFERROR(INDEX(Tabla1012_1[Inventario_disponible],MATCH(1,(Tabla1012_1[Nombre_desarrollo]=Tabla2[[#This Row],[Nombre_desarrollo]])*(Tabla1012_1[Fecha]=_xlfn.MAXIFS(Tabla1012_1[Fecha],Tabla1012_1[Nombre_desarrollo],Tabla2[[#This Row],[Nombre_desarrollo]])),0)),\"\")=0,\"Vendido\",\"Disponible\")","v":"Disponible"}]
["Cholula 665- Etapa 2","larreategui 665","Centro","AAFECO",null,null,2,2,"tabique",0,28,4,null,"Privado","Caseta de vigilancia",null,"Si",null,"",null,null,null,null,1,null,null,null,null,"Si","1,2,3,4",20,1,0,20000,"Si","No","junio 25","junio 25",{"$f":"IF(IFERROR(_xlfn.MINIFS(Tabla1012_1[Fecha],Tabla1012_1[Nombre_desarrollo],Tabla2[[#This Row],[Nombre_desarrollo]],Tabla1012_1[Inventario_disponible],0),\"\")>0,IFERROR(_xlfn.MINIFS(Tabla1012_1[Fecha],Tabla1012_1[Nombre_desarrollo],Tabla2[[#This Row],[Nombre_desarrollo]],Tabla1012_1[Inventario_disponible],0),\"\"),\"\")","v":""},{"$f":"IF(AND(Tabla2[[#This Row],[Fecha_inicio_venta]]=\"\",Tabla2[[#This Row],[Fecha_fin_ventas]]<>\"\"),\"Se necesita fecha_inicio_venta\",IF(AND(Tabla2[[#This Row],[Fecha_inicio_venta]]=\"\",Tabla2[[#This Row],[Fecha_fin_ventas]]=\"\"),\"\",IF(AND(Tabla2[[#This Row],[Fecha_inicio_venta]]<>\"\",Tabla2[[#This Row],[Fecha_fin_ventas]]=\"\"),(YEAR(TODAY())-YEAR(Tabla2[[#This Row],[Fecha_inicio_venta]]))*12 + MONTH(TODAY())-MONTH(Tabla2[[#This Row],[Fecha_inicio_venta]]),(YEAR(Tabla2[[#This Row],[Fecha_fin_ventas]])-YEAR(Tabla2[[#This Row],[Fecha_inicio_venta]]))*12 + MONTH(Tabla2[[#This Row],[Fecha_fin_ventas]])-MONTH(Tabla2[[#This Row],[Fecha_inicio_venta]]))))","v":4},null,null,null,null,"",{"$f":"_xlfn.IFS(AND(Tabla2[[#This Row],[Fecha_inicio_construcción]]<>\"\",Tabla2[[#This Row],[Fecha_fin_construcción]]=\"\"),\"En Construcción\",AND(Tabla2[[#This Row],[Fecha_inicio_construcción]]=\"\",Tabla2[[#This Row],[Fecha_fin_construcción]]=\"\"),\"Tierra\",AND(Tabla2[[#This Row],[Fecha_inicio_construcción]]<>\"\",Tabla2[[#This Row],[Fecha_fin_construcción]]<>\"\"),\"Terminado\",AND(Tabla2[[#This Row],[Fecha_fin_construcción]]<>\"\",Tabla2[[#This Row],[Fecha_inicio_construcción]]=\"\"),\"Falta Fecha:inicio:contruccon\")","v":"Tierra"},{"$f":"IF(IFERROR(INDEX(Tabla1012_1[Inventario_disponible],MATCH(1,(Tabla1012_1[Nombre_desarrollo]=Tabla2[[#This Row],[Nombre_desarrollo]])*(Tabla1012_1[Fecha]=_xlfn.MAXIFS(Tabla1012_1[Fecha],Tabla1012_1[Nombre_desarrollo],Tabla2[[#This Row],[Nombre_desarrollo]])),0)),\"\")=0,\"Vendido\",\"Disponible\")","v":"Disponible"}]
["Punto Portia","Ave siglo XXI esq Garza Sada","Norponiente","Terrahome",null,null,12,5,"Block",3,150,6,null,"Privado","Caseta de vigilancia","Caseta de vigilancia con tarjeta y reconocimiento facial por 2 filtos entrada principal y entrada a edificio","Si",500,"1,2,9,10,19,20,49",null,null,null,null,1,null,null,null,null,"Si","1,2,3,5",10,0,7,5000,"Si","No","Septiembre 2023","Septiembre 2023",{"$f":"IF(IFERROR(_xlfn.MINIFS(Tabla1012_1[Fecha],Tabla1012_1[Nombre_desarrollo],Tabla2[[#This Row],[Nombre_desarrollo]],Tabla1012_1[Inventario_disponible],0),\"\")>0,IFERROR(_xlfn.MINIFS(Tabla1012_1[Fecha],Tabla1012_1[Nombre_desarrollo],Tabla2[[#This Row],[Nombre_desarrollo]],Tabla1012_1[Inventario_disponible],0),\"\"),\"\")","v":""},{"$f":"IF(AND(Tabla2[[#This Row],[Fecha_inicio_venta]]=\"\",Tabla2[[#This Row],[Fecha_fin_ventas]]<>\"\"),\"Se necesita fecha_inicio_venta\",IF(AND(Tabla2[[#This Row],[Fecha_inicio_venta]]=\"\",Tabla2[[#This Row],[Fecha_fin_ventas]]=\"\"),\"\",IF(AND(Tabla2[[#This Row],[Fecha_inicio_venta]]<>\"\",Tabla2[[#This Row],[Fecha_fin_ventas]]=\"\"),(YEAR(TODAY())-YEAR(Tabla2[[#This Row],[Fecha_inicio_venta]]))*12 + MONTH(TODAY())-MONTH(Tabla2[[#This Row],[Fecha_inicio_venta]]),(YEAR(Tabla2[[#This Row],[Fecha_fin_ventas]])-YEAR(Tabla2[[#This Row],[Fecha_inicio_venta]]))*12 + MONTH(Tabla2[[#This Row],[Fecha_fin_ventas]])-MONTH(Tabla2[[#This Row],[Fecha_inicio_venta]]))))","v":25},null,null,null,null,"",{"$f":"_xlfn.IFS(AND(Tabla2[[#This Row],[Fecha_inicio_construcción]]<>\"\",Tabla2[[#This Row],[Fecha_fin_construcción]]=\"\"),\"En Construcción\",AND(Tabla2[[#This Row],[Fecha_inicio_construcción]]=\"\",Tabla2[[#This Row],[Fecha_fin_construcción]]=\"\"),\"Tierra\",AND(Tabla2[[#This Row],[Fecha_inicio_construcción]]<>\"\",Tabla2[[#This Row],[Fecha_fin_construcción]]<>\"\"),\"Terminado\",AND(Tabla2[[#This Row],[Fecha_fin_construcción]]<>\"\",Tabla2[[#This Row],[Fecha_inicio_construcción]]=\"\"),\"Falta Fecha:inicio:contruccon\")","v":"Tierra"},{"$f":"IF(IFERROR(INDEX(Tabla1012_1[Inventario_disponible],MATCH(1,(Tabla1012_1[Nombre_desarrollo]=Tabla2[[#This Row],[Nombre_desarrollo]])*(Tabla1012_1[Fecha]=_xlfn.MAXIFS(Tabla1012_1[Fecha],Tabla1012_1[Nombre_desarrollo],Tabla2[[#This Row],[Nombre_desarrollo]])),0)),\"\")=0,\"Vendido\",\"Disponible\")","v":"Disponible"}]
["Paseos del Sur- Departamentos","Av. Mision de San Margarito esq. Rancho San Antonio s/n Fracc Paseos del Sur",null,"Javer",null,null,1,1,"Block",2,40,2,null,"Abierto","Abierto",null,"No",null,"",null,null,null,null,1,null,null,null,null,"Si","1,2,3,5",10,0,7,5000,"Si","No","abril 25","abril 25",{"$f":"IF(IFERROR(_xlfn.MINIFS(Tabla1012_1[Fecha],Tabla1012_1[Nombre_desarrollo],Tabla2[[#This Row],[Nombre_desarrollo]],Tabla1012_1[Inventario_disponible],0),\"\")>0,IFERROR(_xlfn.MINIFS(Tabla1012_1[Fecha],Tabla1012_1[Nombre_desarrollo],Tabla2[[#This Row],[Nombre_desarrollo]],Tabla1012_1[Inventario_disponible],0),\"\"),\"\")","v":""},{"$f":"IF(AND(Tabla2[[#This Row],[Fecha_inicio_venta]]=\"\",Tabla2[[#This Row],[Fecha_fin_ventas]]<>\"\"),\"Se necesita fecha_inicio_venta\",IF(AND(Tabla2[[#This Row],[Fecha_inicio_venta]]=\"\",Tabla2[[#This Row],[Fecha_fin_ventas]]=\"\"),\"\",IF(AND(Tabla2[[#This Row],[Fecha_inicio_venta]]<>\"\",Tabla2[[#This Row],[Fecha_fin_ventas]]=\"\"),(YEAR(TODAY())-YEAR(Tabla2[[#This Row],[Fecha_inicio_venta]]))*12 + MONTH(TODAY())-MONTH(Tabla2[[#This Row],[Fecha_inicio_venta]]),(YEAR(Tabla2[[#This Row],[Fecha_fin_ventas]])-YEAR(Tabla2[[#This Row],[Fecha_inicio_venta]]))*12 + MONTH(Tabla2[[#This Row],[Fecha_fin_ventas]])-MONTH(Tabla2[[#This Row],[Fecha_inicio_venta]]))))","v":6},null,null,null,null,"",{"$f":"_xlfn.IFS(AND(Tabla2[[#This Row],[Fecha_inicio_construcción]]<>\"\",Tabla2[[#This Row],[Fecha_fin_construcción]]=\"\"),\"En Construcción\",AND(Tabla2[[#This Row],[Fecha_inicio_construcción]]=\"\",Tabla2[[#This Row],[Fecha_fin_construcción]]=\"\"),\"Tierra\",AND(Tabla2[[#This Row],[Fecha_inicio_construcción]]<>\"\",Tabla2[[#This Row],[Fecha_fin_construcción]]<>\"\"),\"Terminado\",AND(Tabla2[[#This Row],[Fecha_fin_construcción]]<>\"\",Tabla2[[#This Row],[Fecha_inicio_construcción]]=\"\"),\"Falta Fecha:inicio:contruccon\")","v":"Tierra"},{"$f":"IF(IFERROR(INDEX(Tabla1012_1[Inventario_disponible],MATCH(1,(Tabla1012_1[Nombre_desarrollo]=Tabla2[[#This Row],[Nombre_desarrollo]])*(Tabla1012_1[Fecha]=_xlfn.MAXIFS(Tabla1012_1[Fecha],Tabla1012_1[Nombre_desarrollo],Tabla2[[#This Row],[Nombre_desarrollo]])),0)),\"\")=0,\"Vendido\",\"Disponible\")","v":"Disponible"}]
["Torre Vertika","Trojes 105, Trojes de Alonso",null,"Independiente",null,null,1,1,"Acero con cemento",5,18,5,null,"Privado","Caseta de vigilancia","Caseta de vigilancia","Si",2200,"4,10,11,23",null,null,null,null,1,null,null,null,null,"Si","1,2,3,5",0.3,0,15,null,null,"No","febrero 2025","febrero 2025",{"$f":"IF(IFERROR(_xlfn.MINIFS(Tabla1012_1[Fecha],Tabla1012_1[Nombre_desarrollo],Tabla2[[#This Row],[Nombre_desarrollo]],Tabla1012_1[Inventario_disponible],0),\"\")>0,IFERROR(_xlfn.MINIFS(Tabla1012_1[Fecha],Tabla1012_1[Nombre_desarrollo],Tabla2[[#This Row],[Nombre_desarrollo]],Tabla1012_1[Inventario_disponible],0),\"\"),\"\")","v":""},{"$f":"IF(AND(Tabla2[[#This Row],[Fecha_inicio_venta]]=\"\",Tabla2[[#This Row],[Fecha_fin_ventas]]<>\"\"),\"Se necesita fecha_inicio_venta\",IF(AND(Tabla2[[#This Row],[Fecha_inicio_venta]]=\"\",Tabla2[[#This Row],[Fecha_fin_ventas]]=\"\"),\"\",IF(AND(Tabla2[[#This Row],[Fecha_inicio_venta]]<>\"\",Tabla2[[#This Row],[Fecha_fin_ventas]]=\"\"),(YEAR(TODAY())-YEAR(Tabla2[[#This Row],[Fecha_inicio_venta]]))*12 + MONTH(TODAY())-MONTH(Tabla2[[#This Row],[Fecha_inicio_venta]]),(YEAR(Tabla2[[#This Row],[Fecha_fin_ventas]])-YEAR(Tabla2[[#This Row],[Fecha_inicio_venta]]))*12 + MONTH(Tabla2[[#This Row],[Fecha_fin_ventas]])-MONTH(Tabla2[[#This Row],[Fecha_inicio_venta]]))))","v":8},null,null,null,null,"",{"$f":"_xlfn.IFS(AND(Tabla2[[#This Row],[Fecha_inicio_construcción]]<>\"\",Tabla2[[#This Row],[Fecha_fin_construcción]]=\"\"),\"En Construcción\",AND(Tabla2[[#This Row],[Fecha_inicio_construcción]]=\"\",Tabla2[[#This Row],[Fecha_fin_construcción]]=\"\"),\"Tierra\",AND(Tabla2[[#This Row],[Fecha_inicio_construcción]]<>\"\",Tabla2[[#This Row],[Fecha_fin_construcción]]<>\"\"),\"Terminado\",AND(Tabla2[[#This Row],[Fecha_fin_construcción]]<>\"\",Tabla2[[#This Row],[Fecha_inicio_construcción]]=\"\"),\"Falta Fecha:inicio:contruccon\")","v":"Tierra"},{"$f":"IF(IFERROR(INDEX(Tabla1012_1[Inventario_disponible],MATCH(1,(Tabla1012_1[Nombre_desarrollo]=Tabla2[[#This Row],[Nombre_desarrollo]])*(Tabla1012_1[Fecha]=_xlfn.MAXIFS(Tabla1012_1[Fecha],Tabla1012_1[Nombre_desarrollo],Tabla2[[#This Row],[Nombre_desarrollo]])),0)),\"\")=0,\"Vendido\",\"Disponible\")","v":"Disponible"}]

{"sheet":"Info_Prototipos_vertical","index":1,"n_rows":120,"n_cols":20,"rows_kept":120,"cut":false,"hidden":false,"merged":[]}
["Nombre_desarrollo","Tipo_proyecto","Nombre_prototipos","Cantitdad_unidades_prototipo","Número_recámaras","Baños_completos","Medios_baños","Número_plantas","Medida_construcción","Número_de_espacios_para_auto","Distribución","Área_para_clóset","Lavadero","Preparación_para_lavadora/secadora","Extras_en_instalación","Tipo_piso","Medida_piso","Acabados_Interiores","Acabados_exteriores","Acabado_pared"]
["Capittala- Departamentos",{"$f":"IF(Tabla6[[#This Row],[Nombre_desarrollo]]<>\"\",\"Vertical\",\"\")","v":"Vertical"},"Ventus",null,2,2,0,1,60,2,null,"Si","Si","Si",null,"Rectificado","60x60","Yeso pulido en paredes, acabados en pintura blanca, puertas en color blanco, revestimiento en regaderas.","Herreria en balcones, huellas de cemento en cochera.","Yeso pulido"]
["Capittala- Departamentos",{"$f":"IF(Tabla6[[#This Row],[Nombre_desarrollo]]<>\"\",\"Vertical\",\"\")","v":"Vertical"},"Nimbus",null,2,2,0,1,60,2,null,"Si","Si","Si",null,"Rectificado","60x60","Yeso pulido en paredes, acabados en pintura blanca, puertas en color blanco, revestimiento en regaderas.","Herreria en balcones, huellas de cemento en cochera.","Yeso pulido"]
["Mezquite Torre Residencial",{"$f":"IF(Tabla6[[#This Row],[Nombre_desarrollo]]<>\"\",\"Vertical\",\"\")","v":"Vertical"},"Cactus",null,2,2,0,1,"121.32",2,null,"Si","Si","Si","Lavadora, aire acondicionado y gas natural.","Cerámico","90x60","Yeso pulido, acabados en mármol, pisos cerámicos, revestimiento de baños.","Vistas de fachaleta tipo madera.","Yeso pulido"]
["Mezquite Torre Residencial",{"$f":"IF(Tabla6[[#This Row],[Nombre_desarrollo]]<>\"\",\"Vertical\",\"\")","v":"Vertical"},"Agave",null,3,2,1,1,147,2,null,"Si","Si","Si","Lavadora, aire acondicionado y gas natural.","Cerámico","90x60","Yeso pulido, acabados en mármol, pisos cerámicos, revestimiento de baños.","Vistas de fachaleta tipo madera.","Yeso pulido"]
["Punta de Cielo Torre",{"$f":"IF(Tabla6[[#This Row],[Nombre_desarrollo]]<>\"\",\"Vertical\",\"\")","v":"Vertical"},"A",null,1,1,0,1,"71.48",1,null,"Si","Si","Si","Gas natural, agua, preparación para lavadora y secadora y minisplit.","Porcelanato","60x60","Porcelanato, baños en marmól, acccesorios de baño.","Muros con detalles en cantera y madera.","Yeso pulido"]
["Punta de Cielo Torre",{"$f":"IF(Tabla6[[#This Row],[Nombre_desarrollo]]<>\"\",\"Vertical\",\"\")","v":"Vertical"},"B",null,1,1,0,1,"74.40",1,null,"Si","Si","Si","Gas natural, agua, preparación para lavadora y secadora y minisplit.","Porcelanato","60x60","Porcelanato, baños en marmól, acccesorios de baño.","Muros con detalles en cantera y madera.","Yeso pulido"]
["Punta de Cielo Torre",{"$f":"IF(Tabla6[[#This Row],[Nombre_desarrollo]]<>\"\",\"Vertical\",\"\")","v":"Vertical"},"C",null,1,1,0,1,"78.52",1,null,"Si","Si","Si","Gas natural, agua, preparación para lavadora y secadora y minisplit.","Porcelanato","60x60","Porcelanato, baños en marmól, acccesorios de baño.","Muros con detalles en cantera y madera.","Yeso pulido"]
["Punta de Cielo Torre",{"$f":"IF(Tabla6[[#This Row],[Nombre_desarrollo]]<>\"\",\"Vertical\",\"\")","v":"Vertical"},"D",null,2,2,0,1,"83.14",1,null,"Si","Si","Si","Gas natural, agua, preparación para lavadora y secadora y minisplit.","Porcelanato","60x60","Porcelanato, baños en marmól, acccesorios de baño.","Muros con detalles en cantera y madera.","Yeso pulido"]
["Punta de Cielo Torre",{"$f":"IF(Tabla6[[#This Row],[Nombre_desarrollo]]<>\"\",\"Vertical\",\"\")","v":"Vertical"},"E",null,2,2,0,1,"122.42",1,null,"Si","Si","Si","Gas natural, agua, preparación para lavadora y secadora y minisplit.","Porcelanato","60x60","Porcelanato, baños en marmól, acccesorios de baño.","Muros con detalles en cantera y madera.","Yeso pulido"]
["Punta de Cielo Torre",{"$f":"IF(Tabla6[[#This Row],[Nombre_desarrollo]]<>\"\",\"Vertical\",\"\")","v":"Vertical"},"F",null,2,2,0,1,"122.41",1,null,"Si","Si","Si","Gas natural, agua, preparación para lavadora y secadora y minisplit.","Porcelanato","60x60","Porcelanato, baños en marmól, acccesorios de baño.","Muros con detalles en cantera y madera.","Yeso pulido"]
["Torre Beara- Torre 1",{"$f":"IF(Tabla6[[#This Row],[Nombre_desarrollo]]<>\"\",\"Vertical\",\"\")","v":"Vertical"},"A",null,1,1,0,1,65,1,null,"Si","Si","Si","Preparación para lavadora, calentador de paso y minisplit.","Cerámico","60x60","Yeso pulido, revestimiento en baños, mármol y granito.","Acabados en acero y madera.","Yeso pulido"]
["Torre Beara- Torre 1",{"$f":"IF(Tabla6[[#This Row],[Nombre_desarrollo]]<>\"\",\"Vertical\",\"\")","v":"Vertical"},"B",null,2,1,0,1,80,1,null,"Si","Si","Si","Preparación para lavadora, calentador de paso y minisplit.","Cerámico","60x60","Yeso pulido, revestimiento en baños, mármol y granito.","Acabados en acero y madera.","Yeso pulido"]
["Torre Beara- Torre 1",{"$f":"IF(Tabla6[[#This Row],[Nombre_desarrollo]]<>\"\",\"Vertical\",\"\")","v":"Vertical"},"C",null,2,2,0,1,95,2,null,"Si","Si","Si","Preparación para lavadora, calentador de paso y minisplit.","Cerámico","60x60","Yeso pulido, revestimiento en baños, mármol y granito.","Acabados en acero y madera.","Yeso pulido"]
["Torre Beara- Torre 1",{"$f":"IF(Tabla6[[#This Row],[Nombre_desarrollo]]<>\"\",\"Vertical\",\"\")","v":"Vertical"},"D",null,3,2,1,1,105,2,null,"Si","Si","Si","Preparación para lavadora, calentador de paso y minisplit.","Cerámico","60x60","Yeso pulido, revestimiento en baños, mármol y granito.","Acabados en acero y madera.","Yeso pulido"]
["Torre Beara- Torre 2",{"$f":"IF(Tabla6[[#This Row],[Nombre_desarrollo]]<>\"\",\"Vertical\",\"\")","v":"Vertical"},"A",null,1,1,0,1,65,1,null,"Si","Si","Si","Preparación para lavadora, calentador de paso y minisplit.","Cerámico","60x60","Yeso pulido, revestimiento en baños, mármol y granito.","Acabados en acero y madera.","Yeso pulido"]
["Torre Beara- Torre 2",{"$f":"IF(Tabla6[[#This Row],[Nombre_desarrollo]]<>\"\",\"Vertical\",\"\")","v":"Vertical"},"B",null,2,1,0,1,80,1,null,"Si","Si","Si","Preparación para lavadora, calentador de paso y minisplit.","Cerámico","60x60","Yeso pulido, revestimiento en baños, mármol y granito.","Acabados en acero y madera.","Yeso pulido"]
["Torre Beara- Torre 2",{"$f":"IF(Tabla6[[#This Row],[Nombre_desarrollo]]<>\"\",\"Vertical\",\"\")","v":"Vertical"},"C",null,2,2,0,1,95,2,null,"Si","Si","Si","Preparación para lavadora, calentador de paso y minisplit.","Cerámico","60x60","Yeso pulido, revestimiento en baños, mármol y granito.","Acabados en acero y madera.","Yeso pulido"]
["Torre Beara- Torre 2",{"$f":"IF(Tabla6[[#This Row],[Nombre_desarrollo]]<>\"\",\"Vertical\",\"\")","v":"Vertical"},"D",null,3,2,1,1,105,2,null,"Si","Si","Si","Preparación para lavadora, calentador de paso y minisplit.","Cerámico","60x60","Yeso pulido, revestimiento en baños, mármol y granito.","Acabados en acero y madera.","Yeso pulido"]
["Torre Laurel",{"$f":"IF(Tabla6[[#This Row],[Nombre_desarrollo]]<>\"\",\"Vertical\",\"\")","v":"Vertical"},"Romero",null,1,1,1,1,82,1,null,"Si","Si","Si","Preparación para minisplit y calentador solar."]
["Torres Verona",{"$f":"IF(Tabla6[[#This Row],[Nombre_desarrollo]]<>\"\",\"Vertical\",\"\")","v":"Vertical"},"Molto_planta baja",null,2,2,0,1,78.5,1,null,"Si","Si","Si","calentador de paso, agua, gas, lavadora minisplit","Cerámico","55x55","Yeso pulido, closets de madera, cocina con acabados en granito, piso cerámico.","Yeso pulido","Yeso pulido"]
["Torres Verona",{"$f":"IF(Tabla6[[#This Row],[Nombre_desarrollo]]<>\"\",\"Vertical\",\"\")","v":"Vertical"},"Molto_primer nivel",null,2,2,0,1,78.5,1,null,"Si","Si","Si","calentador de paso, agua, gas, lavadora minisplit","Cerámico","55x55","Yeso pulido, closets de madera, cocina con acabados en granito, piso cerámico.","Yeso pulido","Yeso pulido"]
["Torres Verona",{"$f":"IF(Tabla6[[#This Row],[Nombre_desarrollo]]<>\"\",\"Vertical\",\"\")","v":"Vertical"},"Molto_segundo nivel",null,2,2,0,1,78.5,1,null,"Si","Si","Si","calentador de paso, agua, gas, lavadora minisplit","Cerámico","55x55","Yeso pulido, closets de madera, cocina con acabados en granito, piso cerámico.","Yeso pulido","Yeso pulido"]
["Mision 208- deptos",{"$f":"IF(Tabla6[[#This Row],[Nombre_desarrollo]]<>\"\",\"Vertical\",\"\")","v":"Vertical"},"M_1",null,3,2,0,1,106,2,null,"Si","Si","Si","Instalaciones para gas y minisplit.","Cerámico","90x60","Yeso pulido, acabados en mármol, pisos cerámicos, revestimiento de baños.","Vistas de fachaleta tipo madera.","Yeso pulido"]
["Mision 208- deptos",{"$f":"IF(Tabla6[[#This Row],[Nombre_desarrollo]]<>\"\",\"Vertical\",\"\")","v":"Vertical"},"M_2",null,2,2,0,1,95,2,null,"Si","Si","Si","Instalaciones para gas y minisplit.","Cerámico","90x60","Yeso pulido, acabados en mármol, pisos cerámicos, revestimiento de baños.","Vistas de fachaleta tipo madera.","Yeso pulido"]
["Mision 208- deptos",{"$f":"IF(Tabla6[[#This Row],[Nombre_desarrollo]]<>\"\",\"Vertical\",\"\")","v":"Vertical"},"M_3",null,3,2,0,1,110,2,null,"Si","Si","Si","Lavadora, aire acondicionado y gas natural.","Cerámico","90x60","Yeso pulido, acabados en mármol, pisos cerámicos, revestimiento de baños.","Vistas de fachaleta tipo madera.","Yeso pulido"]
["Mision 208- deptos",{"$f":"IF(Tabla6[[#This Row],[Nombre_desarrollo]]<>\"\",\"Vertical\",\"\")","v":"Vertical"},"M_4",null,3,2,0,1,92,2,null,"Si","Si","Si","Lavadora, aire acondicionado y gas natural.","Cerámico","90x60","Yeso pulido, acabados en mármol, pisos cerámicos, revestimiento de baños.","Vistas de fachaleta tipo madera.","Yeso pulido"]
["Mision 208- deptos",{"$f":"IF(Tabla6[[#This Row],[Nombre_desarrollo]]<>\"\",\"Vertical\",\"\")","v":"Vertical"},"M_5",null,2,2,0,1,109,2,null,"Si","Si","Si","Instalaciones para gas y minisplit.","Cerámico","90x60","Yeso pulido, acabados en mármol, pisos cerámicos, revestimiento de baños.","Vistas de fachaleta tipo madera.","Yeso pulido"]
["Reserva Quetzales Torres",{"$f":"IF(Tabla6[[#This Row],[Nombre_desarrollo]]<>\"\",\"Vertical\",\"\")","v":"Vertical"},"Champey",null,2,2,0,1,"78.5",1,null,"Si","Si","Si","calentador de paso, agua, gas, lavadora minisplit","Cerámico","55x55","Yeso pulido, closets de madera, cocina con acabados en granito, piso cerámico.","Yeso pulido","Yeso pulido"]
["Reserva Quetzales Torres",{"$f":"IF(Tabla6[[#This Row],[Nombre_desarrollo]]<>\"\",\"Vertical\",\"\")","v":"Vertical"},"Caoba",null,2,2,0,1,"78.5",1,null,"Si","Si","Si","calentador de paso, agua, gas, lavadora minisplit","Cerámico","55x55","Yeso pulido, closets de madera, cocina con acabados en granito, piso cerámico.","Yeso pulido","Yeso pulido"]
["Reserva Quetzales Torres",{"$f":"IF(Tabla6[[#This Row],[Nombre_desarrollo]]<>\"\",\"Vertical\",\"\")","v":"Vertical"},"Languin",null,2,2,0,1,"78.5",1,null,"Si","Si","Si","calentador de paso, agua, gas, lavadora minisplit","Cerámico","55x55","Yeso pulido, closets de madera, cocina con acabados en granito, piso cerámico.","Yeso pulido","Yeso pulido"]
["Via 422",{"$f":"IF(Tabla6[[#This Row],[Nombre_desarrollo]]<>\"\",\"Vertical\",\"\")","v":"Vertical"},"Mesina",null,2,2,1,2,135,1,null,"Si","Si","Si","Minsplit, boiler","Porcelanato","120x60","yeso pulido, cocina de madera y granito, pisos cerámicos."]
["Via 422",{"$f":"IF(Tabla6[[#This Row],[Nombre_desarrollo]]<>\"\",\"Vertical\",\"\")","v":"Vertical"},"Biella",null,2,2,1,2,117,1,null,"Si","Si","Si","Minsplit, boiler","Porcelanato","120x60","yeso pulido, cocina de madera y granito, pisos cerámicos."]
["Via 422",{"$f":"IF(Tabla6[[#This Row],[Nombre_desarrollo]]<>\"\",\"Vertical\",\"\")","v":"Vertical"},"Cosenza",null,3,2,0,1,119,1,null,"Si","Si","Si","Minsplit, boiler","Porcelanato","120x60","yeso pulido, cocina de madera y granito, pisos cerámicos."]
["Via 422",{"$f":"IF(Tabla6[[#This Row],[Nombre_desarrollo]]<>\"\",\"Vertical\",\"\")","v":"Vertical"},"Arezzo",null,3,2,1,1,133,1,null,"Si","Si","Si","Minsplit, boiler","Porcelanato","120x60","yeso pulido, cocina de madera y granito, pisos cerámicos."]
["Via 422",{"$f":"IF(Tabla6[[#This Row],[Nombre_desarrollo]]<>\"\",\"Vertical\",\"\")","v":"Vertical"},"Trentino",null,3,2,1,1,126,1,null,"Si","Si","Si","Minsplit, boiler","Porcelanato","120x60","yeso pulido, cocina de madera y granito, pisos cerámicos."]
["Torre Canteras",{"$f":"IF(Tabla6[[#This Row],[Nombre_desarrollo]]<>\"\",\"Vertical\",\"\")","v":"Vertical"},"A",null,2,2,0,1,63,1,null,null,"Si","Si",null,"Cerámico","60x60","Yeso pulido, cabados en pintura blanca, revestimiento en baños.",null,"Yeso pulido"]
["Torre Canteras",{"$f":"IF(Tabla6[[#This Row],[Nombre_desarrollo]]<>\"\",\"Vertical\",\"\")","v":"Vertical"},"B",null,null,null,null,null,63,1,null,null,"Si","Si",null,"Cerámico","60x60","Yeso pulido, cabados en pintura blanca, revestimiento en baños.",null,"Yeso pulido"]
["Torre Canteras",{"$f":"IF(Tabla6[[#This Row],[Nombre_desarrollo]]<>\"\",\"Vertical\",\"\")","v":"Vertical"},"C",null,null,null,null,null,63,1,null,null,"Si","Si",null,"Cerámico","60x60","Yeso pulido, cabados en pintura blanca, revestimiento en baños.",null,"Yeso pulido"]
["Vilanova Departamentos",{"$f":"IF(Tabla6[[#This Row],[Nombre_desarrollo]]<>\"\",\"Vertical\",\"\")","v":"Vertical"},"Aurora",null,2,2,0,1,"59.67",1,null,"Si","Si","Si","Preparación para minisplit","Porcelanato","55x55","Puerta principal de multipanel, puerts interiores abatibles de hdf, yeso pulido en paredes, sanitario once piece, lavamanos y pedestal, regadera de plato redonda, juego de accesorios marca dica, monomando lavamanos.","marco de aluminio en color negro,","Yeso pulido"]
["Vilanova Departamentos",{"$f":"IF(Tabla6[[#This Row],[Nombre_desarrollo]]<>\"\",\"Vertical\",\"\")","v":"Vertical"},"Alba",null,2,2,0,1,"57.62",1,null,"Si","Si","Si","Preparación para minisplit","Porcelanato","55x55","Puerta principal de multipanel, puerts interiores abatibles de hdf, yeso pulido en paredes, sanitario once piece, lavamanos y pedestal, regadera de plato redonda, juego de accesorios marca dica, monomando lavamanos.","marco de aluminio en color negro,","Yeso pulido"]
["Ferrara Departamentos",{"$f":"IF(Tabla6[[#This Row],[Nombre_desarrollo]]<>\"\",\"Vertical\",\"\")","v":"Vertical"},"Albedro",null,2,2,0,1,"57.16",1,null,"Si","Si","Si","Preparación para minisplit","Porcelanato","55x55","Puerta principal de multipanel, puerts interiores abatibles de hdf, yeso pulido en paredes, sanitario once piece, lavamanos y pedestal, regadera de plato redonda, juego de accesorios marca dica, monomando lavamanos.","marco de aluminio en color negro,","Yeso pulido"]
["Ferrara Departamentos",{"$f":"IF(Tabla6[[#This Row],[Nombre_desarrollo]]<>\"\",\"Vertical\",\"\")","v":"Vertical"},"Olivo",null,2,1,0,1,"50.78",1,null,"Si","Si","Si","Preparación para minisplit","Porcelanato","55x55","Puerta principal de multipanel, puerts interiores abatibles de hdf, yeso pulido en paredes, sanitario once piece, lavamanos y pedestal, regadera de plato redonda, juego de accesorios marca dica, monomando lavamanos.","marco de aluminio en color negro,","Yeso pulido"]
["Ferrara Departamentos",{"$f":"IF(Tabla6[[#This Row],[Nombre_desarrollo]]<>\"\",\"Vertical\",\"\")","v":"Vertical"},"Encina",null,2,2,0,1,"59.76",1,null,"Si","Si","Si","Preparación para minisplit","Porcelanato","55x55","Puerta principal de multipanel, puerts interiores abatibles de hdf, yeso pulido en paredes, sanitario once piece, lavamanos y pedestal, regadera de plato redonda, juego de accesorios marca dica, monomando lavamanos.","marco de aluminio en color negro,","Yeso pulido"]
["Ferrara Departamentos",{"$f":"IF(Tabla6[[#This Row],[Nombre_desarrollo]]<>\"\",\"Vertical\",\"\")","v":"Vertical"},"Sabina",null,2,2,0,1,"57.92",1,null,"Si","Si","Si","Preparación para minisplit","Porcelanato","55x55","Puerta principal de multipanel, puerts interiores abatibles de hdf, yeso pulido en paredes, sanitario once piece, lavamanos y pedestal, regadera de plato redonda, juego de accesorios marca dica, monomando lavamanos.","marco de aluminio en color negro,","Yeso pulido"]
["Sentzia loft&living",{"$f":"IF(Tabla6[[#This Row],[Nombre_desarrollo]]<>\"\",\"Vertical\",\"\")","v":"Vertical"},"Loft1",null,1,1,0,1,53,2,null,"Si","Si","Si","preparacion para a/a","Cerámico","18x50","Yeso pulido, cabados en pintura blanca, revestimiento en baños.",null,"Yeso pulido"]
["Sentzia loft&living",{"$f":"IF(Tabla6[[#This Row],[Nombre_desarrollo]]<>\"\",\"Vertical\",\"\")","v":"Vertical"},"Loft2",null,1,1,0,1,64,1,null,"Si","Si","Si","preparacion para a/a","Cerámico","18x50","Yeso pulido, cabados en pintura blanca, revestimiento en baños.",null,"Yeso pulido"]
["Sentzia loft&living",{"$f":"IF(Tabla6[[#This Row],[Nombre_desarrollo]]<>\"\",\"Vertical\",\"\")","v":"Vertical"},"Living1",null,2,2,0,1,103,1,null,"Si","Si","Si","preparacion para a/a","Cerámico","18x50","Yeso pulido, cabados en pintura blanca, revestimiento en baños.",null,"Yeso pulido"]
["Sentzia loft&living",{"$f":"IF(Tabla6[[#This Row],[Nombre_desarrollo]]<>\"\",\"Vertical\",\"\")","v":"Vertical"},"Living2",null,3,2,0,1,129,1,null,"Si","Si","Si","preparacion para a/a","Cerámico","18x50","Yeso pulido, cabados en pintura blanca, revestimiento en baños.",null,"Yeso pulido"]
["Real de Parras",{"$f":"IF(Tabla6[[#This Row],[Nombre_desarrollo]]<>\"\",\"Vertical\",\"\")","v":"Vertical"},"Planta Baja",null,2,1,0,1,"58.7",1,null,"Si","Si","Si","preparacion para a/a","ceramico","18x50","Yeso pulido, cabados en pintura blanca, revestimiento en baños.",null,"Yeso pulido"]
["Real de Parras",{"$f":"IF(Tabla6[[#This Row],[Nombre_desarrollo]]<>\"\",\"Vertical\",\"\")","v":"Vertical"},"Planta Media",null,2,1,0,1,"58.7",1,null,"Si","Si","Si","preparacion para a/a","ceramico","18x50","Yeso pulido, cabados en pintura blanca, revestimiento en baños.",null,"Yeso pulido"]
["Real de Parras",{"$f":"IF(Tabla6[[#This Row],[Nombre_desarrollo]]<>\"\",\"Vertical\",\"\")","v":"Vertical"},"Planta Alta",null,2,1,0,1,"58.7",1,null,"Si","Si","Si","preparacion para a/a","ceramico","18x50","Yeso pulido, cabados en pintura blanca, revestimiento en baños.",null,"Yeso pulido"]
["Real de Parras",{"$f":"IF(Tabla6[[#This Row],[Nombre_desarrollo]]<>\"\",\"Vertical\",\"\")","v":"Vertical"},"Planta Roof",null,2,1,0,1,"58.7",1,null,"Si","Si","Si","preparacion para a/a","ceramico","18x50","Yeso pulido, cabados en pintura blanca, revestimiento en baños.",null,"Yeso pulido"]
["Torre Omega",{"$f":"IF(Tabla6[[#This Row],[Nombre_desarrollo]]<>\"\",\"Vertical\",\"\")","v":"Vertical"},"A",null,2,2,0,1,162,2,null,"Si","Si","Si","preparacion para a/a","Cerámico","60x60","Enyesado pulido, cocina de madera, granito pisos cerámicos.","Vistas en piedra galarza y tipo madera.","Yeso pulido"]
["Torre Omega",{"$f":"IF(Tabla6[[#This Row],[Nombre_desarrollo]]<>\"\",\"Vertical\",\"\")","v":"Vertical"},"B",null,2,2,0,1,"118.95",2,null,"Si","Si","Si","preparacion para a/a","Cerámico","60x60","Enyesado pulido, cocina de madera, granito pisos cerámicos.","Vistas en piedra galarza y tipo madera.","Yeso pulido"]
["Torre Omega",{"$f":"IF(Tabla6[[#This Row],[Nombre_desarrollo]]<>\"\",\"Vertical\",\"\")","v":"Vertical"},"C",null,2,2,0,1,81,2,null,"Si","Si","Si","preparacion para a/a","Cerámico","60x60","Enyesado pulido, cocina de madera, granito pisos cerámicos.","Vistas en piedra galarza y tipo madera.","Yeso pulido"]
["Mazaryk",{"$f":"IF(Tabla6[[#This Row],[Nombre_desarrollo]]<>\"\",\"Vertical\",\"\")","v":"Vertical"},"A1",null,2,2,0,1,"120.7",2,null,"Si","Si","Si","preparacion para a/a","Cerámico","60x60","Enyesado pulido, cocina de madera, granito pisos cerámicos.","Vistas en piedra galarza y tipo madera.","Yeso pulido"]
["Mazaryk",{"$f":"IF(Tabla6[[#This Row],[Nombre_desarrollo]]<>\"\",\"Vertical\",\"\")","v":"Vertical"},"A2",null,2,2,0,1,"119.74",2,null,"Si","Si","Si","preparacion para a/a","Cerámico","60x60","Enyesado pulido, cocina de madera, granito pisos cerámicos.","Vistas en piedra galarza y tipo madera.","Yeso pulido"]
["Mazaryk",{"$f":"IF(Tabla6[[#This Row],[Nombre_desarrollo]]<>\"\",\"Vertical\",\"\")","v":"Vertical"},"B3",null,2,2,0,1,"124.02",2,null,"Si","Si","Si","preparacion para a/a","Cerámico","60x60","Enyesado pulido, cocina de madera, granito pisos cerámicos.","Vistas en piedra galarza y tipo madera.","Yeso pulido"]
["Mazaryk",{"$f":"IF(Tabla6[[#This Row],[Nombre_desarrollo]]<>\"\",\"Vertical\",\"\")","v":"Vertical"},"C2",null,1,1,0,1,"85.23",1,null,"Si","Si","Si","preparacion para a/a","Cerámico","60x60","Enyesado pulido, cocina de madera, granito pisos cerámicos.","Vistas en piedra galarza y tipo madera.","Yeso pulido"]
["Reserva Quetzales Torre 2",{"$f":"IF(Tabla6[[#This Row],[Nombre_desarrollo]]<>\"\",\"Vertical\",\"\")","v":"Vertical"},"Champey",null,2,2,0,1,"78.5",1,null,"Si","Si","Si","calentador de paso, agua, gas, lavadora minisplit","Cerámico","55x55","Yeso pulido, closets de madera, cocina con acabados en granito, piso cerámico.","Yeso pulido","Yeso pulido"]
["Reserva Quetzales Torre 2",{"$f":"IF(Tabla6[[#This Row],[Nombre_desarrollo]]<>\"\",\"Vertical\",\"\")","v":"Vertical"},"Caoba",null,2,2,0,1,"78.5",1,null,"Si","Si","Si","calentador de paso, agua, gas, lavadora minisplit","Cerámico","55x55","Yeso pulido, closets de madera, cocina con acabados en granito, piso cerámico.","Yeso pulido","Yeso pulido"]
["Reserva Quetzales Torre 2",{"$f":"IF(Tabla6[[#This Row],[Nombre_desarrollo]]<>\"\",\"Vertical\",\"\")","v":"Vertical"},"Languin",null,2,2,0,1,"78.5",1,null,"Si","Si","Si","calentador de paso, agua, gas, lavadora minisplit","Cerámico","55x55","Yeso pulido, closets de madera, cocina con acabados en granito, piso cerámico.","Yeso pulido","Yeso pulido"]
["Reserva Quetzales Torre 3",{"$f":"IF(Tabla6[[#This Row],[Nombre_desarrollo]]<>\"\",\"Vertical\",\"\")","v":"Vertical"},"Champey",null,2,2,0,1,"78.5",1,null,"Si","Si","Si","calentador de paso, agua, gas, lavadora minisplit","Cerámico","55x55","Yeso pulido, closets de madera, cocina con acabados en granito, piso cerámico.","Yeso pulido","Yeso pulido"]
["Reserva Quetzales Torre 3",{"$f":"IF(Tabla6[[#This Row],[Nombre_desarrollo]]<>\"\",\"Vertical\",\"\")","v":"Vertical"},"Caoba",null,2,2,0,1,"78.5",1,null,"Si","Si","Si","calentador de paso, agua, gas, lavadora minisplit","Cerámico","55x55","Yeso pulido, closets de madera, cocina con acabados en granito, piso cerámico.","Yeso pulido","Yeso pulido"]
["Reserva Quetzales Torre 3",{"$f":"IF(Tabla6[[#This Row],[Nombre_desarrollo]]<>\"\",\"Vertical\",\"\")","v":"Vertical"},"Languin",null,2,2,0,1,"78.5",1,null,"Si","Si","Si","calentador de paso, agua, gas, lavadora minisplit","Cerámico","55x55","Yeso pulido, closets de madera, cocina con acabados en granito, piso cerámico.","Yeso pulido","Yeso pulido"]
["Torre Beara- Torre 3",{"$f":"IF(Tabla6[[#This Row],[Nombre_desarrollo]]<>\"\",\"Vertical\",\"\")","v":"Vertical"},"B",null,1,1,0,1,"88.22",1,null,"Si","Si","Si","Preparación para lavadora, calentador de paso y minisplit.","Cerámico","60x60","Yeso pulido, revestimiento en baños, mármol y granito.","Acabados en acero y madera.","Yeso pulido"]
["Torre Beara- Torre 3",{"$f":"IF(Tabla6[[#This Row],[Nombre_desarrollo]]<>\"\",\"Vertical\",\"\")","v":"Vertical"},"C",null,2,2,0,1,"100.42",2,null,"Si","Si","Si","Preparación para lavadora, calentador de paso y minisplit.","Cerámico","60x60","Yeso pulido, revestimiento en baños, mármol y granito.","Acabados en acero y madera.","Yeso pulido"]
["Torre Beara- Torre 3",{"$f":"IF(Tabla6[[#This Row],[Nombre_desarrollo]]<>\"\",\"Vertical\",\"\")","v":"Vertical"},"D",null,3,2,1,1,"112.45",2,null,"Si","Si","Si","Preparación para lavadora, calentador de paso y minisplit.","Cerámico","60x60","Yeso pulido, revestimiento en baños, mármol y granito.","Acabados en acero y madera.","Yeso pulido"]
["Torre Beara- Torre 3",{"$f":"IF(Tabla6[[#This Row],[Nombre_desarrollo]]<>\"\",\"Vertical\",\"\")","v":"Vertical"},"E",null,3,3,0,1,"139.68",2,null,"Si","Si","Si","Preparación para lavadora, calentador de paso y minisplit.","Cerámico","60x60","Yeso pulido, revestimiento en baños, mármol y granito.","Acabados en acero y madera.","Yeso pulido"]
["Valtica Torre",{"$f":"IF(Tabla6[[#This Row],[Nombre_desarrollo]]<>\"\",\"Vertical\",\"\")","v":"Vertical"},"Piso 4",null,2,2,0,1,"92.36",1,null,"Si","Si","Si","Preparacion para a/a","Cerámico","45x75","Paredes texturizadas, pisos cerámicos, baños con placa en mármol con regaderas revestidas, espacio para closet.","Huellas de cemento en cochera, vistas cerámicas tipo madera, ventanas con marco de aluminio.","Yeso pulido"]
["Valtica Torre",{"$f":"IF(Tabla6[[#This Row],[Nombre_desarrollo]]<>\"\",\"Vertical\",\"\")","v":"Vertical"},"Piso 1",null,2,2,0,1,"94.07",1,null,"Si","Si","Si","Preparacion para a/a","Cerámico","45x75","Paredes texturizadas, pisos cerámicos, baños con placa en mármol con regaderas revestidas, espacio para closet.","Huellas de cemento en cochera, vistas cerámicas tipo madera, ventanas con marco de aluminio.","Yeso pulido"]
["Valtica Torre",{"$f":"IF(Tabla6[[#This Row],[Nombre_desarrollo]]<>\"\",\"Vertical\",\"\")","v":"Vertical"},"Piso 3",null,2,2,0,1,"98.18",2,null,"Si","Si","Si","Preparacion para a/a","Cerámico","45x75","Paredes texturizadas, pisos cerámicos, baños con placa en mármol con regaderas revestidas, espacio para closet.","Huellas de cemento en cochera, vistas cerámicas tipo madera, ventanas con marco de aluminio.","Yeso pulido"]
["Valtica Torre",{"$f":"IF(Tabla6[[#This Row],[Nombre_desarrollo]]<>\"\",\"Vertical\",\"\")","v":"Vertical"},"Piso 2",null,2,2,0,1,"104.68",2,null,"Si","Si","Si","Preparacion para a/a","Cerámico","45x75","Paredes texturizadas, pisos cerámicos, baños con placa en mármol con regaderas revestidas, espacio para closet.","Huellas de cemento en cochera, vistas cerámicas tipo madera, ventanas con marco de aluminio.","Yeso pulido"]
["Torre Nogales",{"$f":"IF(Tabla6[[#This Row],[Nombre_desarrollo]]<>\"\",\"Vertical\",\"\")","v":"Vertical"},"AN",null,1,1,1,1,"61.05",1,null,"Si","Si","Si","preparacion para a/a","Cerámico","60x60","Paredes en yeso pulido, piso cerámico, escaleras con piso de adoquín, puertas de madera, espacio para closet, accesorios en baño.","Enjarre en cochera, pasto y huellas de cemento, vista de herrería en fachada planta alta.","Yeso pulido"]
["Torre Nogales",{"$f":"IF(Tabla6[[#This Row],[Nombre_desarrollo]]<>\"\",\"Vertical\",\"\")","v":"Vertical"},"BN",null,1,2,0,1,"65.79",1,null,"Si","Si","Si","preparacion para a/a","Cerámico","60x60","Paredes en yeso pulido, piso cerámico, escaleras con piso de adoquín, puertas de madera, espacio para closet, accesorios en baño.","Enjarre en cochera, pasto y huellas de cemento, vista de herrería en fachada planta alta.","Yeso pulido"]
["Torre Nogales",{"$f":"IF(Tabla6[[#This Row],[Nombre_desarrollo]]<>\"\",\"Vertical\",\"\")","v":"Vertical"},"CN",null,1,2,0,1,"72.68",1,null,"Si","Si","Si","preparacion para a/a","Cerámico","60x60","Paredes en yeso pulido, piso cerámico, escaleras con piso de adoquín, puertas de madera, espacio para closet, accesorios en baño.","Enjarre en cochera, pasto y huellas de cemento, vista de herrería en fachada planta alta.","Yeso pulido"]
["Torre Mezquital",{"$f":"IF(Tabla6[[#This Row],[Nombre_desarrollo]]<>\"\",\"Vertical\",\"\")","v":"Vertical"},"AM",null,1,1,0,1,"58.39",1,null,"Si","Si","Si","preparacion para a/a","Cerámico","60x60","Paredes en yeso pulido, piso cerámico, escaleras con piso de adoquín, puertas de madera, espacio para closet, accesorios en baño.","Enjarre en cochera, pasto y huellas de cemento, vista de herrería en fachada planta alta.","Yeso pulido"]
["Torre Mezquital",{"$f":"IF(Tabla6[[#This Row],[Nombre_desarrollo]]<>\"\",\"Vertical\",\"\")","v":"Vertical"},"CM",null,1,2,0,1,"82.66",1,null,"Si","Si","Si","preparacion para a/a","Cerámico","60x60","Paredes en yeso pulido, piso cerámico, escaleras con piso de adoquín, puertas de madera, espacio para closet, accesorios en baño.","Enjarre en cochera, pasto y huellas de cemento, vista de herrería en fachada planta alta.","Yeso pulido"]
["Torre Mezquital",{"$f":"IF(Tabla6[[#This Row],[Nombre_desarrollo]]<>\"\",\"Vertical\",\"\")","v":"Vertical"},"PH",null,1,2,0,1,100,1,null,"Si","Si","Si","preparacion para a/a","Cerámico","60x60","Paredes en yeso pulido, piso cerámico, escaleras con piso de adoquín, puertas de madera, espacio para closet, accesorios en baño.","Enjarre en cochera, pasto y huellas de cemento, vista de herrería en fachada planta alta.","Yeso pulido"]
["Verona Torres 2",{"$f":"IF(Tabla6[[#This Row],[Nombre_desarrollo]]<>\"\",\"Vertical\",\"\")","v":"Vertical"},"Aruba",null,2,2,0,1,108,1,null,"Si","Si","Si",null,"Cerámico","55x55","Yeso pulido, closets de madera, cocina con acabados en granito, piso cerámico.","Yeso pulido","Yeso pulido"]
["Verona Torres 2",{"$f":"IF(Tabla6[[#This Row],[Nombre_desarrollo]]<>\"\",\"Vertical\",\"\")","v":"Vertical"},"Creta",null,2,2,0,1,81,1,null,"Si","Si","Si",null,"Cerámico","55x55","Yeso pulido, closets de madera, cocina con acabados en granito, piso cerámico.","Yeso pulido","Yeso pulido"]
["Verona Torres 2",{"$f":"IF(Tabla6[[#This Row],[Nombre_desarrollo]]<>\"\",\"Vertical\",\"\")","v":"Vertical"},"Lanka",null,2,2,0,1,81,1,null,"Si","si","Si",null,"Cerámico","55x55","Yeso pulido, closets de madera, cocina con acabados en granito, piso cerámico.","Yeso pulido","Yeso pulido"]
["kamorebi Torres",{"$f":"IF(Tabla6[[#This Row],[Nombre_desarrollo]]<>\"\",\"Vertical\",\"\")","v":"Vertical"},"Nox",null,3,2,0,1,116,1,null,"Si","Si","Si",null,"Cerámico","55x55","Yeso pulido, closets de madera, cocina con acabados en granito, piso cerámico.","Yeso pulido","Yeso pulido"]
["kamorebi Torres",{"$f":"IF(Tabla6[[#This Row],[Nombre_desarrollo]]<>\"\",\"Vertical\",\"\")","v":"Vertical"},"Name",null,3,2,0,1,102,1,null,"Si","Si","Si",null,"Cerámico","55x55","Yeso pulido, closets de madera, cocina con acabados en granito, piso cerámico.","Yeso pulido","Yeso pulido"]
["kamorebi Torres",{"$f":"IF(Tabla6[[#This Row],[Nombre_desarrollo]]<>\"\",\"Vertical\",\"\")","v":"Vertical"},"Vultus",null,3,2,0,1,102,1,null,"Si","si","Si",null,"Cerámico","55x55","Yeso pulido, closets de madera, cocina con acabados en granito, piso cerámico.","Yeso pulido","Yeso pulido"]
["Sierra Morena 415",{"$f":"IF(Tabla6[[#This Row],[Nombre_desarrollo]]<>\"\",\"Vertical\",\"\")","v":"Vertical"},101,null,2,2,1,1,157.32,2,null,"Si","Si","Si","Preparación para minisplit.","Cerámico","60x60","Enyesado pulido, cocina de madera, granito pisos cerámicos.","Vistas en piedra galarza y tipo madera.","Yeso pulido"]
["Sierra Morena 415",{"$f":"IF(Tabla6[[#This Row],[Nombre_desarrollo]]<>\"\",\"Vertical\",\"\")","v":"Vertical"},102,null,1,1,1,1,68.84,1,null,"Si","Si","Si","Preparación para minisplit.","Cerámico","60x60","Enyesado pulido, cocina de madera, granito pisos cerámicos.","Vistas en piedra galarza y tipo madera.","Yeso pulido"]
["Sierra Morena 415",{"$f":"IF(Tabla6[[#This Row],[Nombre_desarrollo]]<>\"\",\"Vertical\",\"\")","v":"Vertical"},103,null,1,1,1,1,99.01,1,null,"Si","Si","Si","Preparación para minisplit.","Cerámico","60x60","Enyesado pulido, cocina de madera, granito pisos cerámicos.","Vistas en piedra galarza y tipo madera.","Yeso pulido"]
["Sierra Morena 415",{"$f":"IF(Tabla6[[#This Row],[Nombre_desarrollo]]<>\"\",\"Vertical\",\"\")","v":"Vertical"},201,null,2,2,1,1,135.81,1,null,"Si","Si","Si","Preparación para minisplit.","Cerámico","60x60","Enyesado pulido, cocina de madera, granito pisos cerámicos.","Vistas en piedra galarza y tipo madera.","Yeso pulido"]
["Sierra Morena 415",{"$f":"IF(Tabla6[[#This Row],[Nombre_desarrollo]]<>\"\",\"Vertical\",\"\")","v":"Vertical"},301,null,2,2,1,1,135.81,1,null,"Si","Si","Si","Preparación para minisplit.","Cerámico","60x60","Enyesado pulido, cocina de madera, granito pisos cerámicos.","Vistas en piedra galarza y tipo madera.","Yeso pulido"]
["Sierra Morena 415",{"$f":"IF(Tabla6[[#This Row],[Nombre_desarrollo]]<>\"\",\"Vertical\",\"\")","v":"Vertical"},401,null,2,2,1,1,135.81,1,null,"Si","Si","Si","Preparación para minisplit.","Cerámico","60x60","Enyesado pulido, cocina de madera, granito pisos cerámicos.","Vistas en piedra galarza y tipo madera.","Yeso pulido"]
["Sierra Morena 415",{"$f":"IF(Tabla6[[#This Row],[Nombre_desarrollo]]<>\"\",\"Vertical\",\"\")","v":"Vertical"},501,null,2,2,1,1,135.81,1,null,"Si","Si","Si","Preparación para minisplit.","Cerámico","60x60","Enyesado pulido, cocina de madera, granito pisos cerámicos.","Vistas en piedra galarza y tipo madera.","Yeso pulido"]
["Sierra Morena 415",{"$f":"IF(Tabla6[[#This Row],[Nombre_desarrollo]]<>\"\",\"Vertical\",\"\")","v":"Vertical"},202,null,2,2,1,1,140.76,2,null,"Si","Si","Si","Preparación para minisplit.","Cerámico","60x60","Enyesado pulido, cocina de madera, granito pisos cerámicos.","Vistas en piedra galarza y tipo madera.","Yeso pulido"]
["Sierra Morena 415",{"$f":"IF(Tabla6[[#This Row],[Nombre_desarrollo]]<>\"\",\"Vertical\",\"\")","v":"Vertical"},302,null,2,2,1,1,140.76,2,null,"Si","Si","Si","Preparación para minisplit.","Cerámico","60x60","Enyesado pulido, cocina de madera, granito pisos cerámicos.","Vistas en piedra galarza y tipo madera.","Yeso pulido"]
["Sierra Morena 415",{"$f":"IF(Tabla6[[#This Row],[Nombre_desarrollo]]<>\"\",\"Vertical\",\"\")","v":"Vertical"},402,null,2,2,1,1,140.76,2,null,"Si","Si","Si","Preparación para minisplit.","Cerámico","60x60","Enyesado pulido, cocina de madera, granito pisos cerámicos.","Vistas en piedra galarza y tipo madera.","Yeso pulido"]
["Sierra Morena 415",{"$f":"IF(Tabla6[[#This Row],[Nombre_desarrollo]]<>\"\",\"Vertical\",\"\")","v":"Vertical"},502,null,3,3,1,2,212.51,2,null,"Si","Si","Si","Preparación para minisplit.","Cerámico","60x60","Enyesado pulido, cocina de madera, granito pisos cerámicos.","Vistas en piedra galarza y tipo madera.","Yeso pulido"]
["GTO 211",{"$f":"IF(Tabla6[[#This Row],[Nombre_desarrollo]]<>\"\",\"Vertical\",\"\")","v":"Vertical"},"M1",null,1,1,0,1,63,1,null,"si","si","si","minisplit","Cerámico","60x60","Yeso pulido, paneles cerámicos de relieve tipo madera.","Yeso pulido y cantera.","Yeso pulido"]
["GTO 211",{"$f":"IF(Tabla6[[#This Row],[Nombre_desarrollo]]<>\"\",\"Vertical\",\"\")","v":"Vertical"},"M2",null,2,1,0,1,81,1,null,"si","si","si","minisplit","Cerámico","60x60","Yeso pulido, paneles cerámicos de relieve tipo madera.","Yeso pulido y cantera.","Yeso pulido"]
["GTO 211",{"$f":"IF(Tabla6[[#This Row],[Nombre_desarrollo]]<>\"\",\"Vertical\",\"\")","v":"Vertical"},"M3",null,2,1,0,1,105,1,null,"si","si","si","minisplit","Cerámico","60x60","Yeso pulido, paneles cerámicos de relieve tipo madera.","Yeso pulido y cantera.","Yeso pulido"]
["Cholula 665 ",{"$f":"IF(Tabla6[[#This Row],[Nombre_desarrollo]]<>\"\",\"Vertical\",\"\")","v":"Vertical"},"Sepia",null,1,1,0,1,65,1,null,"Si","Si","Si","Boiler, lavadora, minisplit, secadora.","Cerámico","60x60","Yeso pulido en paredes con estuco, cocina de madera con barras de granito, pisos en recamaras y escalera, loseta tipo madera.","Yeso pulido","Yeso pulido"]
["Cholula 665 ",{"$f":"IF(Tabla6[[#This Row],[Nombre_desarrollo]]<>\"\",\"Vertical\",\"\")","v":"Vertical"},"Bisonte",null,2,2,0,2,170,1,null,"Si","Si","Si","Boiler, lavadora, minisplit, secadora.","Cerámico","60x60","Yeso pulido en paredes con estuco, cocina de madera con barras de granito, pisos en recamaras y escalera, loseta tipo madera.","Yeso pulido","Yeso pulido"]
["Cholula 665 ",{"$f":"IF(Tabla6[[#This Row],[Nombre_desarrollo]]<>\"\",\"Vertical\",\"\")","v":"Vertical"},"Topazio",null,2,1,1,1,95,1,null,"Si","Si","Si","Boiler, lavadora, minisplit, secadora.","Cerámico","60x60","Yeso pulido en paredes con estuco, cocina de madera con barras de granito, pisos en recamaras y escalera, loseta tipo madera.","Yeso pulido","Yeso pulido"]
["Cholula 665- Etapa 2",{"$f":"IF(Tabla6[[#This Row],[Nombre_desarrollo]]<>\"\",\"Vertical\",\"\")","v":"Vertical"},"Sepia",null,1,1,0,1,65,1,null,"Si","Si","Si","Boiler, lavadora, minisplit, secadora.","Cerámico","60x60","Yeso pulido en paredes con estuco, cocina de madera con barras de granito, pisos en recamaras y escalera, loseta tipo madera.","Yeso pulido","Yeso pulido"]
["Cholula 665- Etapa 2",{"$f":"IF(Tabla6[[#This Row],[Nombre_desarrollo]]<>\"\",\"Vertical\",\"\")","v":"Vertical"},"Marron",null,2,1,0,1,85,1,null,"Si","Si","Si","Boiler, lavadora, minisplit, secadora.","Cerámico","60x60","Yeso pulido en paredes con estuco, cocina de madera con barras de granito, pisos en recamaras y escalera, loseta tipo madera.","Yeso pulido","Yeso pulido"]
["Cholula 665- Etapa 2",{"$f":"IF(Tabla6[[#This Row],[Nombre_desarrollo]]<>\"\",\"Vertical\",\"\")","v":"Vertical"},"Bisonte",null,2,2,0,2,170,1,null,"Si","Si","Si","Boiler, lavadora, minisplit, secadora.","Cerámico","60x60","Yeso pulido en paredes con estuco, cocina de madera con barras de granito, pisos en recamaras y escalera, loseta tipo madera.","Yeso pulido","Yeso pulido"]
["Cholula 665- Etapa 2",{"$f":"IF(Tabla6[[#This Row],[Nombre_desarrollo]]<>\"\",\"Vertical\",\"\")","v":"Vertical"},"Topazio",null,2,1,1,1,95,1,null,"Si","Si","Si","Boiler, lavadora, minisplit, secadora.","Cerámico","60x60","Yeso pulido en paredes con estuco, cocina de madera con barras de granito, pisos en recamaras y escalera, loseta tipo madera.","Yeso pulido","Yeso pulido"]
["Punto Portia",{"$f":"IF(Tabla6[[#This Row],[Nombre_desarrollo]]<>\"\",\"Vertical\",\"\")","v":"Vertical"},"Terra PB",null,2,2,0,1,61.73,1,null,"Si","Si","Si","Todas las instalaciones son electricas, edicicio libre de gas","Cerámico","60x60","Enyesado pulido, cocina de madera, granito pisos cerámicos.","Vistas en loseta tipo madera y cantera gris.","Yeso pulido"]
["Punto Portia",{"$f":"IF(Tabla6[[#This Row],[Nombre_desarrollo]]<>\"\",\"Vertical\",\"\")","v":"Vertical"},"Terra Plus PB",null,2,2,0,1,67.099999999999994,1,null,"Si","Si","Si","Todas las instalaciones son electricas, edicicio libre de gas","Cerámico","60x60","Enyesado pulido, cocina de madera, granito pisos cerámicos.","Vistas en loseta tipo madera y cantera gris.","Yeso pulido"]
["Punto Portia",{"$f":"IF(Tabla6[[#This Row],[Nombre_desarrollo]]<>\"\",\"Vertical\",\"\")","v":"Vertical"},"Delta Nivel 1",null,2,2,0,1,61.73,1,null,"Si","Si","Si","Todas las instalaciones son electricas, edicicio libre de gas","Cerámico","60x60","Enyesado pulido, cocina de madera, granito pisos cerámicos.","Vistas en loseta tipo madera y cantera gris.","Yeso pulido"]
["Punto Portia",{"$f":"IF(Tabla6[[#This Row],[Nombre_desarrollo]]<>\"\",\"Vertical\",\"\")","v":"Vertical"},"Delta Plus Nivel 1",null,2,2,0,1,72.87,1,null,"Si","Si","Si","Todas las instalaciones son electricas, edicicio libre de gas","Cerámico","60x60","Enyesado pulido, cocina de madera, granito pisos cerámicos.","Vistas en loseta tipo madera y cantera gris.","Yeso pulido"]
["Punto Portia",{"$f":"IF(Tabla6[[#This Row],[Nombre_desarrollo]]<>\"\",\"Vertical\",\"\")","v":"Vertical"},"Altus Nivel 2",null,2,2,0,1,61.73,1,null,"Si","Si","Si","Todas las instalaciones son electricas, edicicio libre de gas","Cerámico","60x60","Enyesado pulido, cocina de madera, granito pisos cerámicos.","Vistas en loseta tipo madera y cantera gris.","Yeso pulido"]
["Punto Portia",{"$f":"IF(Tabla6[[#This Row],[Nombre_desarrollo]]<>\"\",\"Vertical\",\"\")","v":"Vertical"},"Altus Plus Nivel 2",null,2,2,0,1,72.87,1,null,"Si","Si","Si","Todas las instalaciones son electricas, edicicio libre de gas","Cerámico","60x60","Enyesado pulido, cocina de madera, granito pisos cerámicos.","Vistas en loseta tipo madera y cantera gris.","Yeso pulido"]
["Paseos del Sur- Departamentos",{"$f":"IF(Tabla6[[#This Row],[Nombre_desarrollo]]<>\"\",\"Vertical\",\"\")","v":"Vertical"},"Verona PB",null,2,2,0,1,48.76,1,null,"Si","Si","Si","Boiler, lavadora, minisplit, secadora.","Cemento pulido",null,"Tarja en cocina, lavabo, taza de baño sencilla, regaderas sin revestimiento","Enyesado pulido","Enyesado pulido"]
["Paseos del Sur- Departamentos",{"$f":"IF(Tabla6[[#This Row],[Nombre_desarrollo]]<>\"\",\"Vertical\",\"\")","v":"Vertical"},"Verona Niv 1",null,2,2,0,1,43.98,1,null,"Si","Si","Si","Boiler, lavadora, minisplit, secadora.","Cemento pulido",null,"Tarja en cocina, lavabo, taza de baño sencilla, regaderas sin revestimiento","Enyesado pulido","Enyesado pulido"]
["Torre Vertika",{"$f":"IF(Tabla6[[#This Row],[Nombre_desarrollo]]<>\"\",\"Vertical\",\"\")","v":"Vertical"},"Jera",null,1,1,1,1,80.739999999999995,1,null,"Si","Si","Si","Boiler, lavadora, minisplit, secadora.","Cerámico","60x60","Puertas madera color caoba, cocina integral con granito el color se elige por el cliente, ","Yeso pulido","Yeso pulido"]
["Torre Vertika",{"$f":"IF(Tabla6[[#This Row],[Nombre_desarrollo]]<>\"\",\"Vertical\",\"\")","v":"Vertical"},"Othila",null,2,2,0,1,92.63,1,null,"Si","Si","Si","Boiler, lavadora, minisplit, secadora.","Cerámico","60x60","Puertas madera color caoba, cocina integral con granito el color se elige por el cliente, ","Yeso pulido","Yeso pulido"]
["Torre Vertika",{"$f":"IF(Tabla6[[#This Row],[Nombre_desarrollo]]<>\"\",\"Vertical\",\"\")","v":"Vertical"},"Hermes",null,3,2,0,1,134.86000000000001,2,null,"Si","Si","Si","Boiler, lavadora, minisplit, secadora.","Cerámico","60x60","Puertas madera color caoba, cocina integral con granito el color se elige por el cliente, ","Yeso pulido","Yeso pulido"]
["Torre Vertika",{"$f":"IF(Tabla6[[#This Row],[Nombre_desarrollo]]<>\"\",\"Vertical\",\"\")","v":"Vertical"},"Algis",null,3,2,0,1,140.41999999999999,2,null,"Si","Si","Si","Boiler, lavadora, minisplit, secadora.","Cerámico","60x60","Puertas madera color caoba, cocina integral con granito el color se elige por el cliente, ","Yeso pulido","Yeso pulido"]
["Torre Vertika",{"$f":"IF(Tabla6[[#This Row],[Nombre_desarrollo]]<>\"\",\"Vertical\",\"\")","v":"Vertical"},"Anzus",null,3,2,1,2,178.66,2,null,"Si","Si","Si","Boiler, lavadora, minisplit, secadora.","Cerámico","60x60","Puertas madera color caoba, cocina integral con granito el color se elige por el cliente, ","Yeso pulido","Yeso pulido"]

{"sheet":"Horizontal","index":2,"n_rows":86,"n_cols":47,"rows_kept":86,"cut":false,"hidden":false,"merged":[]}
["Nombre_desarrollo","Direccion","Zona","Desarrolladora","Comercializadora","Segementación ","Material_constucción","Número_de_etapas_total_planeadas","Etapa_actual","Casas_planeados","Número_prototipos","Descripción","Medida_barda_perimetral_m2","Tipo_fraccionamiento","Acceso_desarrollo","Vigilancia","Couota_mantenimineto","Amenidades","Otro","Número_unida_1_recamara","Número_unida_2_recamara","Número_unida_3_recamara","Cajones_estacionamientos","Instalacion_Gas_lp","Instalaciones_electricas","Cisterna","Credito_puente","Creditos_aceptados","%_enganche","Plazo_para_pago_de_enganche_(meses)","Plazo_para_pago_de_enganche_(días)","Importe_de_apartado","Importe_de_apartado_incluye_firma_de_contrato","Precio_incluye_escrituración","Fecha_primer_levantamiento","Fecha_inicio_venta","Fecha_fin_ventas","Meses_venta","Fecha_estimada_entrega","Fecha_entrega_ofical","Fecha_inicio_construcción","Fecha_estimada_fin_contruccion","Fecha_fin_construcción","Estatus_obra","Estatus_venta"]
["Amura  ETAPA 2","Av. Atlantico Sn. Rancho Santa Monica","Sur Poniente","Grupo San Cristobal",null,"Residencial A","Block",3,2,150,4,null,3,"Privado","Caseta de Vigilancia","Caseta de vigilancia",null,"1,2,3,4,5,49",null,null,null,null,2,null,null,null,null,null,null,1,0,20000,"Si","No","Agosto 2023","Agosto 2023",{"$f":"IF(IFERROR(_xlfn.MINIFS(Tabla1012_1[Fecha],Tabla1012_1[Nombre_desarrollo],Tabla214[[#This Row],[Nombre_desarrollo]],Tabla1012_1[Inventario_disponible],0),\"\")>0,IFERROR(_xlfn.MINIFS(Tabla1012_1[Fecha],Tabla1012_1[Nombre_desarrollo],Tabla214[[#This Row],[Nombre_desarrollo]],Tabla1012_1[Inventario_disponible],0),\"\"),\"\")","v":""},{"$f":"IF(AND(Tabla214[[#This Row],[Fecha_inicio_venta]]=\"\",Tabla214[[#This Row],[Fecha_fin_ventas]]<>\"\"),\"Se necesita fecha_inicio_venta\",IF(AND(Tabla214[[#This Row],[Fecha_inicio_venta]]=\"\",Tabla214[[#This Row],[Fecha_fin_ventas]]=\"\"),\"\",IF(AND(Tabla214[[#This Row],[Fecha_inicio_venta]]<>\"\",Tabla214[[#This Row],[Fecha_fin_ventas]]=\"\"),(YEAR(TODAY())-YEAR(Tabla214[[#This Row],[Fecha_inicio_venta]]))*12 + MONTH(TODAY())-MONTH(Tabla214[[#This Row],[Fecha_inicio_venta]]),(YEAR(Tabla214[[#This Row],[Fecha_fin_ventas]])-YEAR(Tabla214[[#This Row],[Fecha_inicio_venta]]))*12 + MONTH(Tabla214[[#This Row],[Fecha_fin_ventas]])-MONTH(Tabla214[[#This Row],[Fecha_inicio_venta]]))))","v":26},null,null,null,null,null,{"$f":"_xlfn.IFS(AND(Tabla214[[#This Row],[Fecha_inicio_construcción]]<>\"\",Tabla214[[#This Row],[Fecha_fin_construcción]]=\"\"),\"En Construcción\",AND(Tabla214[[#This Row],[Fecha_inicio_construcción]]=\"\",Tabla214[[#This Row],[Fecha_fin_construcción]]=\"\"),\"Tierra\",AND(Tabla214[[#This Row],[Fecha_inicio_construcción]]<>\"\",Tabla214[[#This Row],[Fecha_fin_construcción]]<>\"\"),\"Terminado\",AND(Tabla214[[#This Row],[Fecha_fin_construcción]]<>\"\",Tabla214[[#This Row],[Fecha_inicio_construcción]]=\"\"),\"Falta Fecha:inicio:contruccon\")","v":"Tierra"},{"$f":"IF(IFERROR(INDEX(Tabla1012_1[Inventario_disponible],MATCH(1,(Tabla1012_1[Nombre_desarrollo]=Tabla214[[#This Row],[Nombre_desarrollo]])*(Tabla1012_1[Fecha]=_xlfn.MAXIFS(Tabla1012_1[Fecha],Tabla1012_1[Nombre_desarrollo],Tabla214[[#This Row],[Nombre_desarrollo]])),0)),\"\")=0,\"Vendido\",\"Disponible\")","v":"Disponible"},null,{"$f":"VLOOKUP($A2,[1]Inf_particular_desarrollo!$A$27:$DO$1009,COLUMN([1]Inf_particular_desarrollo!$I$31),FALSE)","v":{"$error":"#N/A"}}]
["La Cartuja Residencial - Nueva etapa","Palma de Ebrio #1010 Fracc. La Cartuja Jesús María.","Jesús Maria","Impulsa",null,"Media","Block",1,1,163,7,null,null,"Semiprivado","Caseta de vigilancia","Caseta de vigilancia",null,"3",null,null,null,null,2,null,null,null,null,null,null,1,0,"$5,000","Si","No","sep 23","sep 23",{"$f":"IF(IFERROR(_xlfn.MINIFS(Tabla1012_1[Fecha],Tabla1012_1[Nombre_desarrollo],Tabla214[[#This Row],[Nombre_desarrollo]],Tabla1012_1[Inventario_disponible],0),\"\")>0,IFERROR(_xlfn.MINIFS(Tabla1012_1[Fecha],Tabla1012_1[Nombre_desarrollo],Tabla214[[#This Row],[Nombre_desarrollo]],Tabla1012_1[Inventario_disponible],0),\"\"),\"\")","v":""},{"$f":"IF(AND(Tabla214[[#This Row],[Fecha_inicio_venta]]=\"\",Tabla214[[#This Row],[Fecha_fin_ventas]]<>\"\"),\"Se necesita fecha_inicio_venta\",IF(AND(Tabla214[[#This Row],[Fecha_inicio_venta]]=\"\",Tabla214[[#This Row],[Fecha_fin_ventas]]=\"\"),\"\",IF(AND(Tabla214[[#This Row],[Fecha_inicio_venta]]<>\"\",Tabla214[[#This Row],[Fecha_fin_ventas]]=\"\"),(YEAR(TODAY())-YEAR(Tabla214[[#This Row],[Fecha_inicio_venta]]))*12 + MONTH(TODAY())-MONTH(Tabla214[[#This Row],[Fecha_inicio_venta]]),(YEAR(Tabla214[[#This Row],[Fecha_fin_ventas]])-YEAR(Tabla214[[#This Row],[Fecha_inicio_venta]]))*12 + MONTH(Tabla214[[#This Row],[Fecha_fin_ventas]])-MONTH(Tabla214[[#This Row],[Fecha_inicio_venta]]))))","v":25},null,null,null,null,null,{"$f":"_xlfn.IFS(AND(Tabla214[[#This Row],[Fecha_inicio_construcción]]<>\"\",Tabla214[[#This Row],[Fecha_fin_construcción]]=\"\"),\"En Construcción\",AND(Tabla214[[#This Row],[Fecha_inicio_construcción]]=\"\",Tabla214[[#This Row],[Fecha_fin_construcción]]=\"\"),\"Tierra\",AND(Tabla214[[#This Row],[Fecha_inicio_construcción]]<>\"\",Tabla214[[#This Row],[Fecha_fin_construcción]]<>\"\"),\"Terminado\",AND(Tabla214[[#This Row],[Fecha_fin_construcción]]<>\"\",Tabla214[[#This Row],[Fecha_inicio_construcción]]=\"\"),\"Falta Fecha:inicio:contruccon\")","v":"Tierra"},{"$f":"IF(IFERROR(INDEX(Tabla1012_1[Inventario_disponible],MATCH(1,(Tabla1012_1[Nombre_desarrollo]=Tabla214[[#This Row],[Nombre_desarrollo]])*(Tabla1012_1[Fecha]=_xlfn.MAXIFS(Tabla1012_1[Fecha],Tabla1012_1[Nombre_desarrollo],Tabla214[[#This Row],[Nombre_desarrollo]])),0)),\"\")=0,\"Vendido\",\"Disponible\")","v":"Disponible"}]
["Ferrara Casas",null,"Jesús Maria","Grupo San Cristobal",null,"Media",0,1,1,267,6,null,3,"Privado","Caseta de vigilancia","Caseta de vigilancia",null,"1,2,3,4,11,17,26,27,49","Bodegas",null,null,null,1,null,null,null,null,null,null,7,0,20000,"Si ","No","Octubre 2023","Octubre 2023",{"$f":"IF(IFERROR(_xlfn.MINIFS(Tabla1012_1[Fecha],Tabla1012_1[Nombre_desarrollo],Tabla214[[#This Row],[Nombre_desarrollo]],Tabla1012_1[Inventario_disponible],0),\"\")>0,IFERROR(_xlfn.MINIFS(Tabla1012_1[Fecha],Tabla1012_1[Nombre_desarrollo],Tabla214[[#This Row],[Nombre_desarrollo]],Tabla1012_1[Inventario_disponible],0),\"\"),\"\")","v":""},{"$f":"IF(AND(Tabla214[[#This Row],[Fecha_inicio_venta]]=\"\",Tabla214[[#This Row],[Fecha_fin_ventas]]<>\"\"),\"Se necesita fecha_inicio_venta\",IF(AND(Tabla214[[#This Row],[Fecha_inicio_venta]]=\"\",Tabla214[[#This Row],[Fecha_fin_ventas]]=\"\"),\"\",IF(AND(Tabla214[[#This Row],[Fecha_inicio_venta]]<>\"\",Tabla214[[#This Row],[Fecha_fin_ventas]]=\"\"),(YEAR(TODAY())-YEAR(Tabla214[[#This Row],[Fecha_inicio_venta]]))*12 + MONTH(TODAY())-MONTH(Tabla214[[#This Row],[Fecha_inicio_venta]]),(YEAR(Tabla214[[#This Row],[Fecha_fin_ventas]])-YEAR(Tabla214[[#This Row],[Fecha_inicio_venta]]))*12 + MONTH(Tabla214[[#This Row],[Fecha_fin_ventas]])-MONTH(Tabla214[[#This Row],[Fecha_inicio_venta]]))))","v":24},null,null,null,null,null,{"$f":"_xlfn.IFS(AND(Tabla214[[#This Row],[Fecha_inicio_construcción]]<>\"\",Tabla214[[#This Row],[Fecha_fin_construcción]]=\"\"),\"En Construcción\",AND(Tabla214[[#This Row],[Fecha_inicio_construcción]]=\"\",Tabla214[[#This Row],[Fecha_fin_construcción]]=\"\"),\"Tierra\",AND(Tabla214[[#This Row],[Fecha_inicio_construcción]]<>\"\",Tabla214[[#This Row],[Fecha_fin_construcción]]<>\"\"),\"Terminado\",AND(Tabla214[[#This Row],[Fecha_fin_construcción]]<>\"\",Tabla214[[#This Row],[Fecha_inicio_construcción]]=\"\"),\"Falta Fecha:inicio:contruccon\")","v":"Tierra"},{"$f":"IF(IFERROR(INDEX(Tabla1012_1[Inventario_disponible],MATCH(1,(Tabla1012_1[Nombre_desarrollo]=Tabla214[[#This Row],[Nombre_desarrollo]])*(Tabla1012_1[Fecha]=_xlfn.MAXIFS(Tabla1012_1[Fecha],Tabla1012_1[Nombre_desarrollo],Tabla214[[#This Row],[Nombre_desarrollo]])),0)),\"\")=0,\"Vendido\",\"Disponible\")","v":"Disponible"},null,{"$f":"VLOOKUP($A3,[1]Inf_particular_desarrollo!$A$27:$DO$1009,COLUMN([1]Inf_particular_desarrollo!$I$31),FALSE)","v":"Horizontal"}]
["Zekkei Residencial","av. Sangerardo 101, San gerardo, Ags","Sur Poniente","Ricasa",null,"Media","Block",1,1,118,1,null,2.5,"Privado","Caseta de vigilancia","Vigilancia 24/7",600,"2,3,4,21",null,null,null,null,2,null,null,null,null,null,null,1,0,"$10,000","Si","No","Octubre 2023","Octubre 2023",{"$f":"IF(IFERROR(_xlfn.MINIFS(Tabla1012_1[Fecha],Tabla1012_1[Nombre_desarrollo],Tabla214[[#This Row],[Nombre_desarrollo]],Tabla1012_1[Inventario_disponible],0),\"\")>0,IFERROR(_xlfn.MINIFS(Tabla1012_1[Fecha],Tabla1012_1[Nombre_desarrollo],Tabla214[[#This Row],[Nombre_desarrollo]],Tabla1012_1[Inventario_disponible],0),\"\"),\"\")","v":""},{"$f":"IF(AND(Tabla214[[#This Row],[Fecha_inicio_venta]]=\"\",Tabla214[[#This Row],[Fecha_fin_ventas]]<>\"\"),\"Se necesita fecha_inicio_venta\",IF(AND(Tabla214[[#This Row],[Fecha_inicio_venta]]=\"\",Tabla214[[#This Row],[Fecha_fin_ventas]]=\"\"),\"\",IF(AND(Tabla214[[#This Row],[Fecha_inicio_venta]]<>\"\",Tabla214[[#This Row],[Fecha_fin_ventas]]=\"\"),(YEAR(TODAY())-YEAR(Tabla214[[#This Row],[Fecha_inicio_venta]]))*12 + MONTH(TODAY())-MONTH(Tabla214[[#This Row],[Fecha_inicio_venta]]),(YEAR(Tabla214[[#This Row],[Fecha_fin_ventas]])-YEAR(Tabla214[[#This Row],[Fecha_inicio_venta]]))*12 + MONTH(Tabla214[[#This Row],[Fecha_fin_ventas]])-MONTH(Tabla214[[#This Row],[Fecha_inicio_venta]]))))","v":24},null,null,null,null,null,{"$f":"_xlfn.IFS(AND(Tabla214[[#This Row],[Fecha_inicio_construcción]]<>\"\",Tabla214[[#This Row],[Fecha_fin_construcción]]=\"\"),\"En Construcción\",AND(Tabla214[[#This Row],[Fecha_inicio_construcción]]=\"\",Tabla214[[#This Row],[Fecha_fin_construcción]]=\"\"),\"Tierra\",AND(Tabla214[[#This Row],[Fecha_inicio_construcción]]<>\"\",Tabla214[[#This Row],[Fecha_fin_construcción]]<>\"\"),\"Terminado\",AND(Tabla214[[#This Row],[Fecha_fin_construcción]]<>\"\",Tabla214[[#This Row],[Fecha_inicio_construcción]]=\"\"),\"Falta Fecha:inicio:contruccon\")","v":"Tierra"},{"$f":"IF(IFERROR(INDEX(Tabla1012_1[Inventario_disponible],MATCH(1,(Tabla1012_1[Nombre_desarrollo]=Tabla214[[#This Row],[Nombre_desarrollo]])*(Tabla1012_1[Fecha]=_xlfn.MAXIFS(Tabla1012_1[Fecha],Tabla1012_1[Nombre_desarrollo],Tabla214[[#This Row],[Nombre_desarrollo]])),0)),\"\")=0,\"Vendido\",\"Disponible\")","v":"Disponible"}]
["Porta Arvena","av. Alejandro de l Cruz Saucedo 339, Chicahuales, jesus maria Ags.","Nor Poniente","Impulsa",null,"Media",null,1,1,122,3,null,3,"Privado","Caseta de vigilancia","Vigilancia 24/7",950,"1,6,9,25,31",0,null,null,null,2,null,null,null,null,null,null,1,0,"$20,000","Si","No","Abril 2023","Abril 2023",{"$f":"IF(IFERROR(_xlfn.MINIFS(Tabla1012_1[Fecha],Tabla1012_1[Nombre_desarrollo],Tabla214[[#This Row],[Nombre_desarrollo]],Tabla1012_1[Inventario_disponible],0),\"\")>0,IFERROR(_xlfn.MINIFS(Tabla1012_1[Fecha],Tabla1012_1[Nombre_desarrollo],Tabla214[[#This Row],[Nombre_desarrollo]],Tabla1012_1[Inventario_disponible],0),\"\"),\"\")","v":""},{"$f":"IF(AND(Tabla214[[#This Row],[Fecha_inicio_venta]]=\"\",Tabla214[[#This Row],[Fecha_fin_ventas]]<>\"\"),\"Se necesita fecha_inicio_venta\",IF(AND(Tabla214[[#This Row],[Fecha_inicio_venta]]=\"\",Tabla214[[#This Row],[Fecha_fin_ventas]]=\"\"),\"\",IF(AND(Tabla214[[#This Row],[Fecha_inicio_venta]]<>\"\",Tabla214[[#This Row],[Fecha_fin_ventas]]=\"\"),(YEAR(TODAY())-YEAR(Tabla214[[#This Row],[Fecha_inicio_venta]]))*12 + MONTH(TODAY())-MONTH(Tabla214[[#This Row],[Fecha_inicio_venta]]),(YEAR(Tabla214[[#This Row],[Fecha_fin_ventas]])-YEAR(Tabla214[[#This Row],[Fecha_inicio_venta]]))*12 + MONTH(Tabla214[[#This Row],[Fecha_fin_ventas]])-MONTH(Tabla214[[#This Row],[Fecha_inicio_venta]]))))","v":30},null,null,null,null,null,{"$f":"_xlfn.IFS(AND(Tabla214[[#This Row],[Fecha_inicio_construcción]]<>\"\",Tabla214[[#This Row],[Fecha_fin_construcción]]=\"\"),\"En Construcción\",AND(Tabla214[[#This Row],[Fecha_inicio_construcción]]=\"\",Tabla214[[#This Row],[Fecha_fin_construcción]]=\"\"),\"Tierra\",AND(Tabla214[[#This Row],[Fecha_inicio_construcción]]<>\"\",Tabla214[[#This Row],[Fecha_fin_construcción]]<>\"\"),\"Terminado\",AND(Tabla214[[#This Row],[Fecha_fin_construcción]]<>\"\",Tabla214[[#This Row],[Fecha_inicio_construcción]]=\"\"),\"Falta Fecha:inicio:contruccon\")","v":"Tierra"},{"$f":"IF(IFERROR(INDEX(Tabla1012_1[Inventario_disponible],MATCH(1,(Tabla1012_1[Nombre_desarrollo]=Tabla214[[#This Row],[Nombre_desarrollo]])*(Tabla1012_1[Fecha]=_xlfn.MAXIFS(Tabla1012_1[Fecha],Tabla1012_1[Nombre_desarrollo],Tabla214[[#This Row],[Nombre_desarrollo]])),0)),\"\")=0,\"Vendido\",\"Disponible\")","v":"Disponible"},null,{"$f":"VLOOKUP($A4,[1]Inf_particular_desarrollo!$A$27:$DO$1009,COLUMN([1]Inf_particular_desarrollo!$I$31),FALSE)","v":"Horizontal"}]
["Luzia Residencial","an mangata 558, rancho santa monica","Sur Poniente","Aurico",null,"Residencial A","Block",1,1,120,5,null,3,"Privado","Caseta de vigilancia","Caseta de vigilancia",1200,"1,2,3,4,19,27",null,null,null,null,2,null,null,null,null,null,null,1,0,"$20,000","Si","No","octubre 2023","octubre 2023",{"$f":"IF(IFERROR(_xlfn.MINIFS(Tabla1012_1[Fecha],Tabla1012_1[Nombre_desarrollo],Tabla214[[#This Row],[Nombre_desarrollo]],Tabla1012_1[Inventario_disponible],0),\"\")>0,IFERROR(_xlfn.MINIFS(Tabla1012_1[Fecha],Tabla1012_1[Nombre_desarrollo],Tabla214[[#This Row],[Nombre_desarrollo]],Tabla1012_1[Inventario_disponible],0),\"\"),\"\")","v":""},{"$f":"IF(AND(Tabla214[[#This Row],[Fecha_inicio_venta]]=\"\",Tabla214[[#This Row],[Fecha_fin_ventas]]<>\"\"),\"Se necesita fecha_inicio_venta\",IF(AND(Tabla214[[#This Row],[Fecha_inicio_venta]]=\"\",Tabla214[[#This Row],[Fecha_fin_ventas]]=\"\"),\"\",IF(AND(Tabla214[[#This Row],[Fecha_inicio_venta]]<>\"\",Tabla214[[#This Row],[Fecha_fin_ventas]]=\"\"),(YEAR(TODAY())-YEAR(Tabla214[[#This Row],[Fecha_inicio_venta]]))*12 + MONTH(TODAY())-MONTH(Tabla214[[#This Row],[Fecha_inicio_venta]]),(YEAR(Tabla214[[#This Row],[Fecha_fin_ventas]])-YEAR(Tabla214[[#This Row],[Fecha_inicio_venta]]))*12 + MONTH(Tabla214[[#This Row],[Fecha_fin_ventas]])-MONTH(Tabla214[[#This Row],[Fecha_inicio_venta]]))))","v":24},null,null,null,null,null,{"$f":"_xlfn.IFS(AND(Tabla214[[#This Row],[Fecha_inicio_construcción]]<>\"\",Tabla214[[#This Row],[Fecha_fin_construcción]]=\"\"),\"En Construcción\",AND(Tabla214[[#This Row],[Fecha_inicio_construcción]]=\"\",Tabla214[[#This Row],[Fecha_fin_construcción]]=\"\"),\"Tierra\",AND(Tabla214[[#This Row],[Fecha_inicio_construcción]]<>\"\",Tabla214[[#This Row],[Fecha_fin_construcción]]<>\"\"),\"Terminado\",AND(Tabla214[[#This Row],[Fecha_fin_construcción]]<>\"\",Tabla214[[#This Row],[Fecha_inicio_construcción]]=\"\"),\"Falta Fecha:inicio:contruccon\")","v":"Tierra"},{"$f":"IF(IFERROR(INDEX(Tabla1012_1[Inventario_disponible],MATCH(1,(Tabla1012_1[Nombre_desarrollo]=Tabla214[[#This Row],[Nombre_desarrollo]])*(Tabla1012_1[Fecha]=_xlfn.MAXIFS(Tabla1012_1[Fecha],Tabla1012_1[Nombre_desarrollo],Tabla214[[#This Row],[Nombre_desarrollo]])),0)),\"\")=0,\"Vendido\",\"Disponible\")","v":"Disponible"}]
["La Perla Norte- NUEVA ETAPA","Av. Perla Norte 111","Nor Oriente","Aurico",null,"Residencial B","Ladrillo",1,1,217,0,null,3,"Privado","Caseta de Vigilancia","Caseta de vigilancia",1400,"1,2,3,4,26,49","Palapas y Cancha de Tenis.",null,null,null,2,null,null,null,null,null,null,1,0,25000,"Si","No","Abril 2024","Abril 2024",{"$f":"IF(IFERROR(_xlfn.MINIFS(Tabla1012_1[Fecha],Tabla1012_1[Nombre_desarrollo],Tabla214[[#This Row],[Nombre_desarrollo]],Tabla1012_1[Inventario_disponible],0),\"\")>0,IFERROR(_xlfn.MINIFS(Tabla1012_1[Fecha],Tabla1012_1[Nombre_desarrollo],Tabla214[[#This Row],[Nombre_desarrollo]],Tabla1012_1[Inventario_disponible],0),\"\"),\"\")","v":""},{"$f":"IF(AND(Tabla214[[#This Row],[Fecha_inicio_venta]]=\"\",Tabla214[[#This Row],[Fecha_fin_ventas]]<>\"\"),\"Se necesita fecha_inicio_venta\",IF(AND(Tabla214[[#This Row],[Fecha_inicio_venta]]=\"\",Tabla214[[#This Row],[Fecha_fin_ventas]]=\"\"),\"\",IF(AND(Tabla214[[#This Row],[Fecha_inicio_venta]]<>\"\",Tabla214[[#This Row],[Fecha_fin_ventas]]=\"\"),(YEAR(TODAY())-YEAR(Tabla214[[#This Row],[Fecha_inicio_venta]]))*12 + MONTH(TODAY())-MONTH(Tabla214[[#This Row],[Fecha_inicio_venta]]),(YEAR(Tabla214[[#This Row],[Fecha_fin_ventas]])-YEAR(Tabla214[[#This Row],[Fecha_inicio_venta]]))*12 + MONTH(Tabla214[[#This Row],[Fecha_fin_ventas]])-MONTH(Tabla214[[#This Row],[Fecha_inicio_venta]]))))","v":18},null,null,null,null,null,{"$f":"_xlfn.IFS(AND(Tabla214[[#This Row],[Fecha_inicio_construcción]]<>\"\",Tabla214[[#This Row],[Fecha_fin_construcción]]=\"\"),\"En Construcción\",AND(Tabla214[[#This Row],[Fecha_inicio_construcción]]=\"\",Tabla214[[#This Row],[Fecha_fin_construcción]]=\"\"),\"Tierra\",AND(Tabla214[[#This Row],[Fecha_inicio_construcción]]<>\"\",Tabla214[[#This Row],[Fecha_fin_construcción]]<>\"\"),\"Terminado\",AND(Tabla214[[#This Row],[Fecha_fin_construcción]]<>\"\",Tabla214[[#This Row],[Fecha_inicio_construcción]]=\"\"),\"Falta Fecha:inicio:contruccon\")","v":"Tierra"},{"$f":"IF(IFERROR(INDEX(Tabla1012_1[Inventario_disponible],MATCH(1,(Tabla1012_1[Nombre_desarrollo]=Tabla214[[#This Row],[Nombre_desarrollo]])*(Tabla1012_1[Fecha]=_xlfn.MAXIFS(Tabla1012_1[Fecha],Tabla1012_1[Nombre_desarrollo],Tabla214[[#This Row],[Nombre_desarrollo]])),0)),\"\")=0,\"Vendido\",\"Disponible\")","v":"Disponible"}]
["Zekkei Residencial II","av. Sangerardo 101, San gerardo, Ags","Sur Poniente","Ricasa",null,"Media","Block",1,1,138,2,null,{"$error":"#N/A"},"Privado","Caseta de vigilancia",{"$error":"#N/A"},{"$error":"#N/A"},{"$error":"#N/A"},{"$error":"#N/A"},null,null,null,2,null,null,null,null,null,null,1,0,"$10,000","Si","No","00:00:00","00:00:00",{"$f":"IF(IFERROR(_xlfn.MINIFS(Tabla1012_1[Fecha],Tabla1012_1[Nombre_desarrollo],Tabla214[[#This Row],[Nombre_desarrollo]],Tabla1012_1[Inventario_disponible],0),\"\")>0,IFERROR(_xlfn.MINIFS(Tabla1012_1[Fecha],Tabla1012_1[Nombre_desarrollo],Tabla214[[#This Row],[Nombre_desarrollo]],Tabla1012_1[Inventario_disponible],0),\"\"),\"\")","v":""},{"$f":"IF(AND(Tabla214[[#This Row],[Fecha_inicio_venta]]=\"\",Tabla214[[#This Row],[Fecha_fin_ventas]]<>\"\"),\"Se necesita fecha_inicio_venta\",IF(AND(Tabla214[[#This Row],[Fecha_inicio_venta]]=\"\",Tabla214[[#This Row],[Fecha_fin_ventas]]=\"\"),\"\",IF(AND(Tabla214[[#This Row],[Fecha_inicio_venta]]<>\"\",Tabla214[[#This Row],[Fecha_fin_ventas]]=\"\"),(YEAR(TODAY())-YEAR(Tabla214[[#This Row],[Fecha_inicio_venta]]))*12 + MONTH(TODAY())-MONTH(Tabla214[[#This Row],[Fecha_inicio_venta]]),(YEAR(Tabla214[[#This Row],[Fecha_fin_ventas]])-YEAR(Tabla214[[#This Row],[Fecha_inicio_venta]]))*12 + MONTH(Tabla214[[#This Row],[Fecha_fin_ventas]])-MONTH(Tabla214[[#This Row],[Fecha_inicio_venta]]))))","v":1509},null,null,null,null,null,{"$f":"_xlfn.IFS(AND(Tabla214[[#This Row],[Fecha_inicio_construcción]]<>\"\",Tabla214[[#This Row],[Fecha_fin_construcción]]=\"\"),\"En Construcción\",AND(Tabla214[[#This Row],[Fecha_inicio_construcción]]=\"\",Tabla214[[#This Row],[Fecha_fin_construcción]]=\"\"),\"Tierra\",AND(Tabla214[[#This Row],[Fecha_inicio_construcción]]<>\"\",Tabla214[[#This Row],[Fecha_fin_construcción]]<>\"\"),\"Terminado\",AND(Tabla214[[#This Row],[Fecha_fin_construcción]]<>\"\",Tabla214[[#This Row],[Fecha_inicio_construcción]]=\"\"),\"Falta Fecha:inicio:contruccon\")","v":"Tierra"},{"$f":"IF(IFERROR(INDEX(Tabla1012_1[Inventario_disponible],MATCH(1,(Tabla1012_1[Nombre_desarrollo]=Tabla214[[#This Row],[Nombre_desarrollo]])*(Tabla1012_1[Fecha]=_xlfn.MAXIFS(Tabla1012_1[Fecha],Tabla1012_1[Nombre_desarrollo],Tabla214[[#This Row],[Nombre_desarrollo]])),0)),\"\")=0,\"Vendido\",\"Disponible\")","v":"Disponible"},null,{"$f":"VLOOKUP($A5,[1]Inf_particular_desarrollo!$A$27:$DO$1009,COLUMN([1]Inf_particular_desarrollo!$I$31),FALSE)","v":"Horizontal"}]
["Tamara Residencial","Av paseos de las maravillas 297, jesus Maria Ags.","Jesús Maria","Terrahome",null,"Residencial A","Block",1,1,36,3,null,4,"Privado","Caseta de vigilancia","Acceso controlado 24/7",900,"",0,null,null,null,2,null,null,null,null,null,null,1,0,"$20,000","Si","No","00:00:00","00:00:00",{"$f":"IF(IFERROR(_xlfn.MINIFS(Tabla1012_1[Fecha],Tabla1012_1[Nombre_desarrollo],Tabla214[[#This Row],[Nombre_desarrollo]],Tabla1012_1[Inventario_disponible],0),\"\")>0,IFERROR(_xlfn.MINIFS(Tabla1012_1[Fecha],Tabla1012_1[Nombre_desarrollo],Tabla214[[#This Row],[Nombre_desarrollo]],Tabla1012_1[Inventario_disponible],0),\"\"),\"\")","v":""},{"$f":"IF(AND(Tabla214[[#This Row],[Fecha_inicio_venta]]=\"\",Tabla214[[#This Row],[Fecha_fin_ventas]]<>\"\"),\"Se necesita fecha_inicio_venta\",IF(AND(Tabla214[[#This Row],[Fecha_inicio_venta]]=\"\",Tabla214[[#This Row],[Fecha_fin_ventas]]=\"\"),\"\",IF(AND(Tabla214[[#This Row],[Fecha_inicio_venta]]<>\"\",Tabla214[[#This Row],[Fecha_fin_ventas]]=\"\"),(YEAR(TODAY())-YEAR(Tabla214[[#This Row],[Fecha_inicio_venta]]))*12 + MONTH(TODAY())-MONTH(Tabla214[[#This Row],[Fecha_inicio_venta]]),(YEAR(Tabla214[[#This Row],[Fecha_fin_ventas]])-YEAR(Tabla214[[#This Row],[Fecha_inicio_venta]]))*12 + MONTH(Tabla214[[#This Row],[Fecha_fin_ventas]])-MONTH(Tabla214[[#This Row],[Fecha_inicio_venta]]))))","v":1509},null,null,null,null,null,{"$f":"_xlfn.IFS(AND(Tabla214[[#This Row],[Fecha_inicio_construcción]]<>\"\",Tabla214[[#This Row],[Fecha_fin_construcción]]=\"\"),\"En Construcción\",AND(Tabla214[[#This Row],[Fecha_inicio_construcción]]=\"\",Tabla214[[#This Row],[Fecha_fin_construcción]]=\"\"),\"Tierra\",AND(Tabla214[[#This Row],[Fecha_inicio_construcción]]<>\"\",Tabla214[[#This Row],[Fecha_fin_construcción]]<>\"\"),\"Terminado\",AND(Tabla214[[#This Row],[Fecha_fin_construcción]]<>\"\",Tabla214[[#This Row],[Fecha_inicio_construcción]]=\"\"),\"Falta Fecha:inicio:contruccon\")","v":"Tierra"},{"$f":"IF(IFERROR(INDEX(Tabla1012_1[Inventario_disponible],MATCH(1,(Tabla1012_1[Nombre_desarrollo]=Tabla214[[#This Row],[Nombre_desarrollo]])*(Tabla1012_1[Fecha]=_xlfn.MAXIFS(Tabla1012_1[Fecha],Tabla1012_1[Nombre_desarrollo],Tabla214[[#This Row],[Nombre_desarrollo]])),0)),\"\")=0,\"Vendido\",\"Disponible\")","v":"Disponible"},null,{"$f":"VLOOKUP($A6,[1]Inf_particular_desarrollo!$A$27:$DO$1009,COLUMN([1]Inf_particular_desarrollo!$I$31),FALSE)","v":"Horizontal"}]
["Torre Mezquital",null,"Jesús Maria","Terrahome",null,"Media","Block",1,1,20,3,null,3,"Privado","Caseta de vigilancia","Videovigilancia y seguridad 24/7",650,"1,2,3,4",null,null,null,null,1,null,null,null,null,null,null,0,7,"$30,000","Si","No","Marzo 2024","Marzo 2024",{"$f":"IF(IFERROR(_xlfn.MINIFS(Tabla1012_1[Fecha],Tabla1012_1[Nombre_desarrollo],Tabla214[[#This Row],[Nombre_desarrollo]],Tabla1012_1[Inventario_disponible],0),\"\")>0,IFERROR(_xlfn.MINIFS(Tabla1012_1[Fecha],Tabla1012_1[Nombre_desarrollo],Tabla214[[#This Row],[Nombre_desarrollo]],Tabla1012_1[Inventario_disponible],0),\"\"),\"\")","v":""},{"$f":"IF(AND(Tabla214[[#This Row],[Fecha_inicio_venta]]=\"\",Tabla214[[#This Row],[Fecha_fin_ventas]]<>\"\"),\"Se necesita fecha_inicio_venta\",IF(AND(Tabla214[[#This Row],[Fecha_inicio_venta]]=\"\",Tabla214[[#This Row],[Fecha_fin_ventas]]=\"\"),\"\",IF(AND(Tabla214[[#This Row],[Fecha_inicio_venta]]<>\"\",Tabla214[[#This Row],[Fecha_fin_ventas]]=\"\"),(YEAR(TODAY())-YEAR(Tabla214[[#This Row],[Fecha_inicio_venta]]))*12 + MONTH(TODAY())-MONTH(Tabla214[[#This Row],[Fecha_inicio_venta]]),(YEAR(Tabla214[[#This Row],[Fecha_fin_ventas]])-YEAR(Tabla214[[#This Row],[Fecha_inicio_venta]]))*12 + MONTH(Tabla214[[#This Row],[Fecha_fin_ventas]])-MONTH(Tabla214[[#This Row],[Fecha_inicio_venta]]))))","v":19},null,null,null,null,null,{"$f":"_xlfn.IFS(AND(Tabla214[[#This Row],[Fecha_inicio_construcción]]<>\"\",Tabla214[[#This Row],[Fecha_fin_construcción]]=\"\"),\"En Construcción\",AND(Tabla214[[#This Row],[Fecha_inicio_construcción]]=\"\",Tabla214[[#This Row],[Fecha_fin_construcción]]=\"\"),\"Tierra\",AND(Tabla214[[#This Row],[Fecha_inicio_construcción]]<>\"\",Tabla214[[#This Row],[Fecha_fin_construcción]]<>\"\"),\"Terminado\",AND(Tabla214[[#This Row],[Fecha_fin_construcción]]<>\"\",Tabla214[[#This Row],[Fecha_inicio_construcción]]=\"\"),\"Falta Fecha:inicio:contruccon\")","v":"Tierra"},{"$f":"IF(IFERROR(INDEX(Tabla1012_1[Inventario_disponible],MATCH(1,(Tabla1012_1[Nombre_desarrollo]=Tabla214[[#This Row],[Nombre_desarrollo]])*(Tabla1012_1[Fecha]=_xlfn.MAXIFS(Tabla1012_1[Fecha],Tabla1012_1[Nombre_desarrollo],Tabla214[[#This Row],[Nombre_desarrollo]])),0)),\"\")=0,\"Vendido\",\"Disponible\")","v":"Disponible"}]
["Arroyo San Emilion",null,"Nor Poniente","PBC",null,"Media",null,2,2,118,3,null,3,"Privado","Caseta de vigilancia","Caseta de vigilancia",1200,"1,2,3,4,11,17,18,19,20,24,25,31,47","Área de yoga y sala de juegos.",null,null,null,2,null,null,null,null,null,null,1,0,"$20,000","Si","No","Febrero 2024","Febrero 2024",{"$f":"IF(IFERROR(_xlfn.MINIFS(Tabla1012_1[Fecha],Tabla1012_1[Nombre_desarrollo],Tabla214[[#This Row],[Nombre_desarrollo]],Tabla1012_1[Inventario_disponible],0),\"\")>0,IFERROR(_xlfn.MINIFS(Tabla1012_1[Fecha],Tabla1012_1[Nombre_desarrollo],Tabla214[[#This Row],[Nombre_desarrollo]],Tabla1012_1[Inventario_disponible],0),\"\"),\"\")","v":""},{"$f":"IF(AND(Tabla214[[#This Row],[Fecha_inicio_venta]]=\"\",Tabla214[[#This Row],[Fecha_fin_ventas]]<>\"\"),\"Se necesita fecha_inicio_venta\",IF(AND(Tabla214[[#This Row],[Fecha_inicio_venta]]=\"\",Tabla214[[#This Row],[Fecha_fin_ventas]]=\"\"),\"\",IF(AND(Tabla214[[#This Row],[Fecha_inicio_venta]]<>\"\",Tabla214[[#This Row],[Fecha_fin_ventas]]=\"\"),(YEAR(TODAY())-YEAR(Tabla214[[#This Row],[Fecha_inicio_venta]]))*12 + MONTH(TODAY())-MONTH(Tabla214[[#This Row],[Fecha_inicio_venta]]),(YEAR(Tabla214[[#This Row],[Fecha_fin_ventas]])-YEAR(Tabla214[[#This Row],[Fecha_inicio_venta]]))*12 + MONTH(Tabla214[[#This Row],[Fecha_fin_ventas]])-MONTH(Tabla214[[#This Row],[Fecha_inicio_venta]]))))","v":20},null,null,null,null,null,{"$f":"_xlfn.IFS(AND(Tabla214[[#This Row],[Fecha_inicio_construcción]]<>\"\",Tabla214[[#This Row],[Fecha_fin_construcción]]=\"\"),\"En Construcción\",AND(Tabla214[[#This Row],[Fecha_inicio_construcción]]=\"\",Tabla214[[#This Row],[Fecha_fin_construcción]]=\"\"),\"Tierra\",AND(Tabla214[[#This Row],[Fecha_inicio_construcción]]<>\"\",Tabla214[[#This Row],[Fecha_fin_construcción]]<>\"\"),\"Terminado\",AND(Tabla214[[#This Row],[Fecha_fin_construcción]]<>\"\",Tabla214[[#This Row],[Fecha_inicio_construcción]]=\"\"),\"Falta Fecha:inicio:contruccon\")","v":"Tierra"},{"$f":"IF(IFERROR(INDEX(Tabla1012_1[Inventario_disponible],MATCH(1,(Tabla1012_1[Nombre_desarrollo]=Tabla214[[#This Row],[Nombre_desarrollo]])*(Tabla1012_1[Fecha]=_xlfn.MAXIFS(Tabla1012_1[Fecha],Tabla1012_1[Nombre_desarrollo],Tabla214[[#This Row],[Nombre_desarrollo]])),0)),\"\")=0,\"Vendido\",\"Disponible\")","v":"Disponible"},null,{"$f":"VLOOKUP($A7,[1]Inf_particular_desarrollo!$A$27:$DO$1009,COLUMN([1]Inf_particular_desarrollo!$I$31),FALSE)","v":"Horizontal"}]
["Massara ",null,"Poniente","Aurico",null,"Económica","Block",1,1,25,1,null,null,"Abierto","Abierto",0,null,"49",null,null,null,null,null,null,null,null,null,null,null,{"$error":"#N/A"},{"$error":"#N/A"},{"$error":"#N/A"},{"$error":"#N/A"},{"$error":"#N/A"},"Junio 2024","Junio 2024",{"$f":"IF(IFERROR(_xlfn.MINIFS(Tabla1012_1[Fecha],Tabla1012_1[Nombre_desarrollo],Tabla214[[#This Row],[Nombre_desarrollo]],Tabla1012_1[Inventario_disponible],0),\"\")>0,IFERROR(_xlfn.MINIFS(Tabla1012_1[Fecha],Tabla1012_1[Nombre_desarrollo],Tabla214[[#This Row],[Nombre_desarrollo]],Tabla1012_1[Inventario_disponible],0),\"\"),\"\")","v":""},{"$f":"IF(AND(Tabla214[[#This Row],[Fecha_inicio_venta]]=\"\",Tabla214[[#This Row],[Fecha_fin_ventas]]<>\"\"),\"Se necesita fecha_inicio_venta\",IF(AND(Tabla214[[#This Row],[Fecha_inicio_venta]]=\"\",Tabla214[[#This Row],[Fecha_fin_ventas]]=\"\"),\"\",IF(AND(Tabla214[[#This Row],[Fecha_inicio_venta]]<>\"\",Tabla214[[#This Row],[Fecha_fin_ventas]]=\"\"),(YEAR(TODAY())-YEAR(Tabla214[[#This Row],[Fecha_inicio_venta]]))*12 + MONTH(TODAY())-MONTH(Tabla214[[#This Row],[Fecha_inicio_venta]]),(YEAR(Tabla214[[#This Row],[Fecha_fin_ventas]])-YEAR(Tabla214[[#This Row],[Fecha_inicio_venta]]))*12 + MONTH(Tabla214[[#This Row],[Fecha_fin_ventas]])-MONTH(Tabla214[[#This Row],[Fecha_inicio_venta]]))))","v":16},null,null,null,null,null,{"$f":"_xlfn.IFS(AND(Tabla214[[#This Row],[Fecha_inicio_construcción]]<>\"\",Tabla214[[#This Row],[Fecha_fin_construcción]]=\"\"),\"En Construcción\",AND(Tabla214[[#This Row],[Fecha_inicio_construcción]]=\"\",Tabla214[[#This Row],[Fecha_fin_construcción]]=\"\"),\"Tierra\",AND(Tabla214[[#This Row],[Fecha_inicio_construcción]]<>\"\",Tabla214[[#This Row],[Fecha_fin_construcción]]<>\"\"),\"Terminado\",AND(Tabla214[[#This Row],[Fecha_fin_construcción]]<>\"\",Tabla214[[#This Row],[Fecha_inicio_construcción]]=\"\"),\"Falta Fecha:inicio:contruccon\")","v":"Tierra"},{"$f":"IF(IFERROR(INDEX(Tabla1012_1[Inventario_disponible],MATCH(1,(Tabla1012_1[Nombre_desarrollo]=Tabla214[[#This Row],[Nombre_desarrollo]])*(Tabla1012_1[Fecha]=_xlfn.MAXIFS(Tabla1012_1[Fecha],Tabla1012_1[Nombre_desarrollo],Tabla214[[#This Row],[Nombre_desarrollo]])),0)),\"\")=0,\"Vendido\",\"Disponible\")","v":"Disponible"}]
["Abada Residencial",null,"Nor Poniente",null,null,"Media",{"$error":"#N/A"},2,1,184,3,null,4,"Privado","Caseta de vigilancia","Acceso controlado 24/7",900,"1,2,3,4,6,9,49",0,null,null,null,1,null,null,null,null,null,null,1,0,"$10,000","Si","No","00:00:00","00:00:00",{"$f":"IF(IFERROR(_xlfn.MINIFS(Tabla1012_1[Fecha],Tabla1012_1[Nombre_desarrollo],Tabla214[[#This Row],[Nombre_desarrollo]],Tabla1012_1[Inventario_disponible],0),\"\")>0,IFERROR(_xlfn.MINIFS(Tabla1012_1[Fecha],Tabla1012_1[Nombre_desarrollo],Tabla214[[#This Row],[Nombre_desarrollo]],Tabla1012_1[Inventario_disponible],0),\"\"),\"\")","v":""},{"$f":"IF(AND(Tabla214[[#This Row],[Fecha_inicio_venta]]=\"\",Tabla214[[#This Row],[Fecha_fin_ventas]]<>\"\"),\"Se necesita fecha_inicio_venta\",IF(AND(Tabla214[[#This Row],[Fecha_inicio_venta]]=\"\",Tabla214[[#This Row],[Fecha_fin_ventas]]=\"\"),\"\",IF(AND(Tabla214[[#This Row],[Fecha_inicio_venta]]<>\"\",Tabla214[[#This Row],[Fecha_fin_ventas]]=\"\"),(YEAR(TODAY())-YEAR(Tabla214[[#This Row],[Fecha_inicio_venta]]))*12 + MONTH(TODAY())-MONTH(Tabla214[[#This Row],[Fecha_inicio_venta]]),(YEAR(Tabla214[[#This Row],[Fecha_fin_ventas]])-YEAR(Tabla214[[#This Row],[Fecha_inicio_venta]]))*12 + MONTH(Tabla214[[#This Row],[Fecha_fin_ventas]])-MONTH(Tabla214[[#This Row],[Fecha_inicio_venta]]))))","v":1509},null,null,null,null,null,{"$f":"_xlfn.IFS(AND(Tabla214[[#This Row],[Fecha_inicio_construcción]]<>\"\",Tabla214[[#This Row],[Fecha_fin_construcción]]=\"\"),\"En Construcción\",AND(Tabla214[[#This Row],[Fecha_inicio_construcción]]=\"\",Tabla214[[#This Row],[Fecha_fin_construcción]]=\"\"),\"Tierra\",AND(Tabla214[[#This Row],[Fecha_inicio_construcción]]<>\"\",Tabla214[[#This Row],[Fecha_fin_construcción]]<>\"\"),\"Terminado\",AND(Tabla214[[#This Row],[Fecha_fin_construcción]]<>\"\",Tabla214[[#This Row],[Fecha_inicio_construcción]]=\"\"),\"Falta Fecha:inicio:contruccon\")","v":"Tierra"},{"$f":"IF(IFERROR(INDEX(Tabla1012_1[Inventario_disponible],MATCH(1,(Tabla1012_1[Nombre_desarrollo]=Tabla214[[#This Row],[Nombre_desarrollo]])*(Tabla1012_1[Fecha]=_xlfn.MAXIFS(Tabla1012_1[Fecha],Tabla1012_1[Nombre_desarrollo],Tabla214[[#This Row],[Nombre_desarrollo]])),0)),\"\")=0,\"Vendido\",\"Disponible\")","v":"Disponible"}]
["Cantelli Coto Granito",0,"Sur Poniente","GIG",null,"Media","Block",1,1,200,4,null,2,"Privado","Caseta de vigilancia","Caseta de vigilancia",900,"1,2,3,26",null,null,null,null,2,null,null,null,null,null,null,1,0,"$10,000","Si","No","Julio 2024","Julio 2024",{"$f":"IF(IFERROR(_xlfn.MINIFS(Tabla1012_1[Fecha],Tabla1012_1[Nombre_desarrollo],Tabla214[[#This Row],[Nombre_desarrollo]],Tabla1012_1[Inventario_disponible],0),\"\")>0,IFERROR(_xlfn.MINIFS(Tabla1012_1[Fecha],Tabla1012_1[Nombre_desarrollo],Tabla214[[#This Row],[Nombre_desarrollo]],Tabla1012_1[Inventario_disponible],0),\"\"),\"\")","v":""},{"$f":"IF(AND(Tabla214[[#This Row],[Fecha_inicio_venta]]=\"\",Tabla214[[#This Row],[Fecha_fin_ventas]]<>\"\"),\"Se necesita fecha_inicio_venta\",IF(AND(Tabla214[[#This Row],[Fecha_inicio_venta]]=\"\",Tabla214[[#This Row],[Fecha_fin_ventas]]=\"\"),\"\",IF(AND(Tabla214[[#This Row],[Fecha_inicio_venta]]<>\"\",Tabla214[[#This Row],[Fecha_fin_ventas]]=\"\"),(YEAR(TODAY())-YEAR(Tabla214[[#This Row],[Fecha_inicio_venta]]))*12 + MONTH(TODAY())-MONTH(Tabla214[[#This Row],[Fecha_inicio_venta]]),(YEAR(Tabla214[[#This Row],[Fecha_fin_ventas]])-YEAR(Tabla214[[#This Row],[Fecha_inicio_venta]]))*12 + MONTH(Tabla214[[#This Row],[Fecha_fin_ventas]])-MONTH(Tabla214[[#This Row],[Fecha_inicio_venta]]))))","v":15},null,null,null,null,null,{"$f":"_xlfn.IFS(AND(Tabla214[[#This Row],[Fecha_inicio_construcción]]<>\"\",Tabla214[[#This Row],[Fecha_fin_construcción]]=\"\"),\"En Construcción\",AND(Tabla214[[#This Row],[Fecha_inicio_construcción]]=\"\",Tabla214[[#This Row],[Fecha_fin_construcción]]=\"\"),\"Tierra\",AND(Tabla214[[#This Row],[Fecha_inicio_construcción]]<>\"\",Tabla214[[#This Row],[Fecha_fin_construcción]]<>\"\"),\"Terminado\",AND(Tabla214[[#This Row],[Fecha_fin_construcción]]<>\"\",Tabla214[[#This Row],[Fecha_inicio_construcción]]=\"\"),\"Falta Fecha:inicio:contruccon\")","v":"Tierra"},{"$f":"IF(IFERROR(INDEX(Tabla1012_1[Inventario_disponible],MATCH(1,(Tabla1012_1[Nombre_desarrollo]=Tabla214[[#This Row],[Nombre_desarrollo]])*(Tabla1012_1[Fecha]=_xlfn.MAXIFS(Tabla1012_1[Fecha],Tabla1012_1[Nombre_desarrollo],Tabla214[[#This Row],[Nombre_desarrollo]])),0)),\"\")=0,\"Vendido\",\"Disponible\")","v":"Disponible"}]
["Burano","Gral jesus H Alba","Sur Poniente","Grupo Homme",null,"Residencial A","Ladrillo",1,1,148,15,null,4,"Privado","Caseta de vigilancia","Caseta de vigilancia y guardia",null,"1,2,3,4,49",null,null,null,null,null,null,null,null,null,null,null,1,0,"$30,000","Si","No",null,null,{"$f":"IF(IFERROR(_xlfn.MINIFS(Tabla1012_1[Fecha],Tabla1012_1[Nombre_desarrollo],Tabla214[[#This Row],[Nombre_desarrollo]],Tabla1012_1[Inventario_disponible],0),\"\")>0,IFERROR(_xlfn.MINIFS(Tabla1012_1[Fecha],Tabla1012_1[Nombre_desarrollo],Tabla214[[#This Row],[Nombre_desarrollo]],Tabla1012_1[Inventario_disponible],0),\"\"),\"\")","v":""},{"$f":"IF(AND(Tabla214[[#This Row],[Fecha_inicio_venta]]=\"\",Tabla214[[#This Row],[Fecha_fin_ventas]]<>\"\"),\"Se necesita fecha_inicio_venta\",IF(AND(Tabla214[[#This Row],[Fecha_inicio_venta]]=\"\",Tabla214[[#This Row],[Fecha_fin_ventas]]=\"\"),\"\",IF(AND(Tabla214[[#This Row],[Fecha_inicio_venta]]<>\"\",Tabla214[[#This Row],[Fecha_fin_ventas]]=\"\"),(YEAR(TODAY())-YEAR(Tabla214[[#This Row],[Fecha_inicio_venta]]))*12 + MONTH(TODAY())-MONTH(Tabla214[[#This Row],[Fecha_inicio_venta]]),(YEAR(Tabla214[[#This Row],[Fecha_fin_ventas]])-YEAR(Tabla214[[#This Row],[Fecha_inicio_venta]]))*12 + MONTH(Tabla214[[#This Row],[Fecha_fin_ventas]])-MONTH(Tabla214[[#This Row],[Fecha_inicio_venta]]))))","v":""},null,null,null,null,null,{"$f":"_xlfn.IFS(AND(Tabla214[[#This Row],[Fecha_inicio_construcción]]<>\"\",Tabla214[[#This Row],[Fecha_fin_construcción]]=\"\"),\"En Construcción\",AND(Tabla214[[#This Row],[Fecha_inicio_construcción]]=\"\",Tabla214[[#This Row],[Fecha_fin_construcción]]=\"\"),\"Tierra\",AND(Tabla214[[#This Row],[Fecha_inicio_construcción]]<>\"\",Tabla214[[#This Row],[Fecha_fin_construcción]]<>\"\"),\"Terminado\",AND(Tabla214[[#This Row],[Fecha_fin_construcción]]<>\"\",Tabla214[[#This Row],[Fecha_inicio_construcción]]=\"\"),\"Falta Fecha:inicio:contruccon\")","v":"Tierra"},{"$f":"IF(IFERROR(INDEX(Tabla1012_1[Inventario_disponible],MATCH(1,(Tabla1012_1[Nombre_desarrollo]=Tabla214[[#This Row],[Nombre_desarrollo]])*(Tabla1012_1[Fecha]=_xlfn.MAXIFS(Tabla1012_1[Fecha],Tabla1012_1[Nombre_desarrollo],Tabla214[[#This Row],[Nombre_desarrollo]])),0)),\"\")=0,\"Vendido\",\"Disponible\")","v":"Disponible"}]
["Gran reserva Los Angeles",null,"Nor Oriente","Grupo San Cristobal",null,"Media",0,1,1,55,3,null,null,"Privado","Caseta de vigilancia",0,null,"",0,null,null,null,2,null,null,null,null,null,null,1,0,"$20,000","Si","No","00:00:00","00:00:00",{"$f":"IF(IFERROR(_xlfn.MINIFS(Tabla1012_1[Fecha],Tabla1012_1[Nombre_desarrollo],Tabla214[[#This Row],[Nombre_desarrollo]],Tabla1012_1[Inventario_disponible],0),\"\")>0,IFERROR(_xlfn.MINIFS(Tabla1012_1[Fecha],Tabla1012_1[Nombre_desarrollo],Tabla214[[#This Row],[Nombre_desarrollo]],Tabla1012_1[Inventario_disponible],0),\"\"),\"\")","v":""},{"$f":"IF(AND(Tabla214[[#This Row],[Fecha_inicio_venta]]=\"\",Tabla214[[#This Row],[Fecha_fin_ventas]]<>\"\"),\"Se necesita fecha_inicio_venta\",IF(AND(Tabla214[[#This Row],[Fecha_inicio_venta]]=\"\",Tabla214[[#This Row],[Fecha_fin_ventas]]=\"\"),\"\",IF(AND(Tabla214[[#This Row],[Fecha_inicio_venta]]<>\"\",Tabla214[[#This Row],[Fecha_fin_ventas]]=\"\"),(YEAR(TODAY())-YEAR(Tabla214[[#This Row],[Fecha_inicio_venta]]))*12 + MONTH(TODAY())-MONTH(Tabla214[[#This Row],[Fecha_inicio_venta]]),(YEAR(Tabla214[[#This Row],[Fecha_fin_ventas]])-YEAR(Tabla214[[#This Row],[Fecha_inicio_venta]]))*12 + MONTH(Tabla214[[#This Row],[Fecha_fin_ventas]])-MONTH(Tabla214[[#This Row],[Fecha_inicio_venta]]))))","v":1509},null,null,null,null,null,{"$f":"_xlfn.IFS(AND(Tabla214[[#This Row],[Fecha_inicio_construcción]]<>\"\",Tabla214[[#This Row],[Fecha_fin_construcción]]=\"\"),\"En Construcción\",AND(Tabla214[[#This Row],[Fecha_inicio_construcción]]=\"\",Tabla214[[#This Row],[Fecha_fin_construcción]]=\"\"),\"Tierra\",AND(Tabla214[[#This Row],[Fecha_inicio_construcción]]<>\"\",Tabla214[[#This Row],[Fecha_fin_construcción]]<>\"\"),\"Terminado\",AND(Tabla214[[#This Row],[Fecha_fin_construcción]]<>\"\",Tabla214[[#This Row],[Fecha_inicio_construcción]]=\"\"),\"Falta Fecha:inicio:contruccon\")","v":"Tierra"},{"$f":"IF(IFERROR(INDEX(Tabla1012_1[Inventario_disponible],MATCH(1,(Tabla1012_1[Nombre_desarrollo]=Tabla214[[#This Row],[Nombre_desarrollo]])*(Tabla1012_1[Fecha]=_xlfn.MAXIFS(Tabla1012_1[Fecha],Tabla1012_1[Nombre_desarrollo],Tabla214[[#This Row],[Nombre_desarrollo]])),0)),\"\")=0,\"Vendido\",\"Disponible\")","v":"Disponible"}]
["Verona Torres 2",null,"Sur Poniente","Terrahome",null,"Media","Block",1,1,12,3,null,4,"Privado","Caseta de vigilancia","Caseta de vigilancia",450,"1,2,3,19","Área de juegos infantiles.",null,null,null,1,null,null,null,null,null,null,1,0,"$5,000","No","No","junio 2024","junio 2024",{"$f":"IF(IFERROR(_xlfn.MINIFS(Tabla1012_1[Fecha],Tabla1012_1[Nombre_desarrollo],Tabla214[[#This Row],[Nombre_desarrollo]],Tabla1012_1[Inventario_disponible],0),\"\")>0,IFERROR(_xlfn.MINIFS(Tabla1012_1[Fecha],Tabla1012_1[Nombre_desarrollo],Tabla214[[#This Row],[Nombre_desarrollo]],Tabla1012_1[Inventario_disponible],0),\"\"),\"\")","v":""},{"$f":"IF(AND(Tabla214[[#This Row],[Fecha_inicio_venta]]=\"\",Tabla214[[#This Row],[Fecha_fin_ventas]]<>\"\"),\"Se necesita fecha_inicio_venta\",IF(AND(Tabla214[[#This Row],[Fecha_inicio_venta]]=\"\",Tabla214[[#This Row],[Fecha_fin_ventas]]=\"\"),\"\",IF(AND(Tabla214[[#This Row],[Fecha_inicio_venta]]<>\"\",Tabla214[[#This Row],[Fecha_fin_ventas]]=\"\"),(YEAR(TODAY())-YEAR(Tabla214[[#This Row],[Fecha_inicio_venta]]))*12 + MONTH(TODAY())-MONTH(Tabla214[[#This Row],[Fecha_inicio_venta]]),(YEAR(Tabla214[[#This Row],[Fecha_fin_ventas]])-YEAR(Tabla214[[#This Row],[Fecha_inicio_venta]]))*12 + MONTH(Tabla214[[#This Row],[Fecha_fin_ventas]])-MONTH(Tabla214[[#This Row],[Fecha_inicio_venta]]))))","v":16},null,null,null,null,null,{"$f":"_xlfn.IFS(AND(Tabla214[[#This Row],[Fecha_inicio_construcción]]<>\"\",Tabla214[[#This Row],[Fecha_fin_construcción]]=\"\"),\"En Construcción\",AND(Tabla214[[#This Row],[Fecha_inicio_construcción]]=\"\",Tabla214[[#This Row],[Fecha_fin_construcción]]=\"\"),\"Tierra\",AND(Tabla214[[#This Row],[Fecha_inicio_construcción]]<>\"\",Tabla214[[#This Row],[Fecha_fin_construcción]]<>\"\"),\"Terminado\",AND(Tabla214[[#This Row],[Fecha_fin_construcción]]<>\"\",Tabla214[[#This Row],[Fecha_inicio_construcción]]=\"\"),\"Falta Fecha:inicio:contruccon\")","v":"Tierra"},{"$f":"IF(IFERROR(INDEX(Tabla1012_1[Inventario_disponible],MATCH(1,(Tabla1012_1[Nombre_desarrollo]=Tabla214[[#This Row],[Nombre_desarrollo]])*(Tabla1012_1[Fecha]=_xlfn.MAXIFS(Tabla1012_1[Fecha],Tabla1012_1[Nombre_desarrollo],Tabla214[[#This Row],[Nombre_desarrollo]])),0)),\"\")=0,\"Vendido\",\"Disponible\")","v":"Disponible"}]
["kamorebi Torres",null,"Sur Poniente","Impulsa",null,"Media",null,1,1,72,3,null,4,"Privado","Caseta de vigilancia","Caseta de vigilancia",450,"1,2,3,19","Área de juegos infantiles.",null,null,null,1,null,null,null,null,null,null,1,0,"$5,000","No","No","junio 2024","junio 2024",{"$f":"IF(IFERROR(_xlfn.MINIFS(Tabla1012_1[Fecha],Tabla1012_1[Nombre_desarrollo],Tabla214[[#This Row],[Nombre_desarrollo]],Tabla1012_1[Inventario_disponible],0),\"\")>0,IFERROR(_xlfn.MINIFS(Tabla1012_1[Fecha],Tabla1012_1[Nombre_desarrollo],Tabla214[[#This Row],[Nombre_desarrollo]],Tabla1012_1[Inventario_disponible],0),\"\"),\"\")","v":""},{"$f":"IF(AND(Tabla214[[#This Row],[Fecha_inicio_venta]]=\"\",Tabla214[[#This Row],[Fecha_fin_ventas]]<>\"\"),\"Se necesita fecha_inicio_venta\",IF(AND(Tabla214[[#This Row],[Fecha_inicio_venta]]=\"\",Tabla214[[#This Row],[Fecha_fin_ventas]]=\"\"),\"\",IF(AND(Tabla214[[#This Row],[Fecha_inicio_venta]]<>\"\",Tabla214[[#This Row],[Fecha_fin_ventas]]=\"\"),(YEAR(TODAY())-YEAR(Tabla214[[#This Row],[Fecha_inicio_venta]]))*12 + MONTH(TODAY())-MONTH(Tabla214[[#This Row],[Fecha_inicio_venta]]),(YEAR(Tabla214[[#This Row],[Fecha_fin_ventas]])-YEAR(Tabla214[[#This Row],[Fecha_inicio_venta]]))*12 + MONTH(Tabla214[[#This Row],[Fecha_fin_ventas]])-MONTH(Tabla214[[#This Row],[Fecha_inicio_venta]]))))","v":16},null,null,null,null,null,{"$f":"_xlfn.IFS(AND(Tabla214[[#This Row],[Fecha_inicio_construcción]]<>\"\",Tabla214[[#This Row],[Fecha_fin_construcción]]=\"\"),\"En Construcción\",AND(Tabla214[[#This Row],[Fecha_inicio_construcción]]=\"\",Tabla214[[#This Row],[Fecha_fin_construcción]]=\"\"),\"Tierra\",AND(Tabla214[[#This Row],[Fecha_inicio_construcción]]<>\"\",Tabla214[[#This Row],[Fecha_fin_construcción]]<>\"\"),\"Terminado\",AND(Tabla214[[#This Row],[Fecha_fin_construcción]]<>\"\",Tabla214[[#This Row],[Fecha_inicio_construcción]]=\"\"),\"Falta Fecha:inicio:contruccon\")","v":"Tierra"},{"$f":"IF(IFERROR(INDEX(Tabla1012_1[Inventario_disponible],MATCH(1,(Tabla1012_1[Nombre_desarrollo]=Tabla214[[#This Row],[Nombre_desarrollo]])*(Tabla1012_1[Fecha]=_xlfn.MAXIFS(Tabla1012_1[Fecha],Tabla1012_1[Nombre_desarrollo],Tabla214[[#This Row],[Nombre_desarrollo]])),0)),\"\")=0,\"Vendido\",\"Disponible\")","v":"Disponible"}]
["Torrenza",null,"Poniente","Terrahome",null,"Económica","Block",1,1,177,12,null,4,"Privado","Caseta de vigilancia","Caseta de vigilancia y guardia",950,"1,2,3,6,11",null,null,null,null,null,null,null,null,null,null,null,1,0,"$20,000","Si","No","Noviembre 2023","Noviembre 2023",{"$f":"IF(IFERROR(_xlfn.MINIFS(Tabla1012_1[Fecha],Tabla1012_1[Nombre_desarrollo],Tabla214[[#This Row],[Nombre_desarrollo]],Tabla1012_1[Inventario_disponible],0),\"\")>0,IFERROR(_xlfn.MINIFS(Tabla1012_1[Fecha],Tabla1012_1[Nombre_desarrollo],Tabla214[[#This Row],[Nombre_desarrollo]],Tabla1012_1[Inventario_disponible],0),\"\"),\"\")","v":""},{"$f":"IF(AND(Tabla214[[#This Row],[Fecha_inicio_venta]]=\"\",Tabla214[[#This Row],[Fecha_fin_ventas]]<>\"\"),\"Se necesita fecha_inicio_venta\",IF(AND(Tabla214[[#This Row],[Fecha_inicio_venta]]=\"\",Tabla214[[#This Row],[Fecha_fin_ventas]]=\"\"),\"\",IF(AND(Tabla214[[#This Row],[Fecha_inicio_venta]]<>\"\",Tabla214[[#This Row],[Fecha_fin_ventas]]=\"\"),(YEAR(TODAY())-YEAR(Tabla214[[#This Row],[Fecha_inicio_venta]]))*12 + MONTH(TODAY())-MONTH(Tabla214[[#This Row],[Fecha_inicio_venta]]),(YEAR(Tabla214[[#This Row],[Fecha_fin_ventas]])-YEAR(Tabla214[[#This Row],[Fecha_inicio_venta]]))*12 + MONTH(Tabla214[[#This Row],[Fecha_fin_ventas]])-MONTH(Tabla214[[#This Row],[Fecha_inicio_venta]]))))","v":23},null,null,null,null,null,{"$f":"_xlfn.IFS(AND(Tabla214[[#This Row],[Fecha_inicio_construcción]]<>\"\",Tabla214[[#This Row],[Fecha_fin_construcción]]=\"\"),\"En Construcción\",AND(Tabla214[[#This Row],[Fecha_inicio_construcción]]=\"\",Tabla214[[#This Row],[Fecha_fin_construcción]]=\"\"),\"Tierra\",AND(Tabla214[[#This Row],[Fecha_inicio_construcción]]<>\"\",Tabla214[[#This Row],[Fecha_fin_construcción]]<>\"\"),\"Terminado\",AND(Tabla214[[#This Row],[Fecha_fin_construcción]]<>\"\",Tabla214[[#This Row],[Fecha_inicio_construcción]]=\"\"),\"Falta Fecha:inicio:contruccon\")","v":"Tierra"},{"$f":"IF(IFERROR(INDEX(Tabla1012_1[Inventario_disponible],MATCH(1,(Tabla1012_1[Nombre_desarrollo]=Tabla214[[#This Row],[Nombre_desarrollo]])*(Tabla1012_1[Fecha]=_xlfn.MAXIFS(Tabla1012_1[Fecha],Tabla1012_1[Nombre_desarrollo],Tabla214[[#This Row],[Nombre_desarrollo]])),0)),\"\")=0,\"Vendido\",\"Disponible\")","v":"Disponible"}]
["Valdeluz",null,"Poniente","Terrahome",null,"Económica","Block",1,1,43,9,null,3,"Privado","Caseta de vigilancia","Caseta de vigilancia y guardia",800,"1,2,3,6,11","Terraza grill",null,null,null,null,null,null,null,null,null,null,1,0,"$20,000","Si","No","Marzo 2024","Marzo 2024",{"$f":"IF(IFERROR(_xlfn.MINIFS(Tabla1012_1[Fecha],Tabla1012_1[Nombre_desarrollo],Tabla214[[#This Row],[Nombre_desarrollo]],Tabla1012_1[Inventario_disponible],0),\"\")>0,IFERROR(_xlfn.MINIFS(Tabla1012_1[Fecha],Tabla1012_1[Nombre_desarrollo],Tabla214[[#This Row],[Nombre_desarrollo]],Tabla1012_1[Inventario_disponible],0),\"\"),\"\")","v":""},{"$f":"IF(AND(Tabla214[[#This Row],[Fecha_inicio_venta]]=\"\",Tabla214[[#This Row],[Fecha_fin_ventas]]<>\"\"),\"Se necesita fecha_inicio_venta\",IF(AND(Tabla214[[#This Row],[Fecha_inicio_venta]]=\"\",Tabla214[[#This Row],[Fecha_fin_ventas]]=\"\"),\"\",IF(AND(Tabla214[[#This Row],[Fecha_inicio_venta]]<>\"\",Tabla214[[#This Row],[Fecha_fin_ventas]]=\"\"),(YEAR(TODAY())-YEAR(Tabla214[[#This Row],[Fecha_inicio_venta]]))*12 + MONTH(TODAY())-MONTH(Tabla214[[#This Row],[Fecha_inicio_venta]]),(YEAR(Tabla214[[#This Row],[Fecha_fin_ventas]])-YEAR(Tabla214[[#This Row],[Fecha_inicio_venta]]))*12 + MONTH(Tabla214[[#This Row],[Fecha_fin_ventas]])-MONTH(Tabla214[[#This Row],[Fecha_inicio_venta]]))))","v":19},null,null,null,null,null,{"$f":"_xlfn.IFS(AND(Tabla214[[#This Row],[Fecha_inicio_construcción]]<>\"\",Tabla214[[#This Row],[Fecha_fin_construcción]]=\"\"),\"En Construcción\",AND(Tabla214[[#This Row],[Fecha_inicio_construcción]]=\"\",Tabla214[[#This Row],[Fecha_fin_construcción]]=\"\"),\"Tierra\",AND(Tabla214[[#This Row],[Fecha_inicio_construcción]]<>\"\",Tabla214[[#This Row],[Fecha_fin_construcción]]<>\"\"),\"Terminado\",AND(Tabla214[[#This Row],[Fecha_fin_construcción]]<>\"\",Tabla214[[#This Row],[Fecha_inicio_construcción]]=\"\"),\"Falta Fecha:inicio:contruccon\")","v":"Tierra"},{"$f":"IF(IFERROR(INDEX(Tabla1012_1[Inventario_disponible],MATCH(1,(Tabla1012_1[Nombre_desarrollo]=Tabla214[[#This Row],[Nombre_desarrollo]])*(Tabla1012_1[Fecha]=_xlfn.MAXIFS(Tabla1012_1[Fecha],Tabla1012_1[Nombre_desarrollo],Tabla214[[#This Row],[Nombre_desarrollo]])),0)),\"\")=0,\"Vendido\",\"Disponible\")","v":"Disponible"}]
["Maranta",null,"Nor Poniente","Aurico",null,"Media","Block",1,1,46,10,null,4,"Privado","Caseta de vigilancia","Caseta de vigilancia y guardia",1000,"1,2,3",null,null,null,null,null,null,null,null,null,null,null,1,0,"$20,000","Si","No","00:00:00","00:00:00",{"$f":"IF(IFERROR(_xlfn.MINIFS(Tabla1012_1[Fecha],Tabla1012_1[Nombre_desarrollo],Tabla214[[#This Row],[Nombre_desarrollo]],Tabla1012_1[Inventario_disponible],0),\"\")>0,IFERROR(_xlfn.MINIFS(Tabla1012_1[Fecha],Tabla1012_1[Nombre_desarrollo],Tabla214[[#This Row],[Nombre_desarrollo]],Tabla1012_1[Inventario_disponible],0),\"\"),\"\")","v":""},{"$f":"IF(AND(Tabla214[[#This Row],[Fecha_inicio_venta]]=\"\",Tabla214[[#This Row],[Fecha_fin_ventas]]<>\"\"),\"Se necesita fecha_inicio_venta\",IF(AND(Tabla214[[#This Row],[Fecha_inicio_venta]]=\"\",Tabla214[[#This Row],[Fecha_fin_ventas]]=\"\"),\"\",IF(AND(Tabla214[[#This Row],[Fecha_inicio_venta]]<>\"\",Tabla214[[#This Row],[Fecha_fin_ventas]]=\"\"),(YEAR(TODAY())-YEAR(Tabla214[[#This Row],[Fecha_inicio_venta]]))*12 + MONTH(TODAY())-MONTH(Tabla214[[#This Row],[Fecha_inicio_venta]]),(YEAR(Tabla214[[#This Row],[Fecha_fin_ventas]])-YEAR(Tabla214[[#This Row],[Fecha_inicio_venta]]))*12 + MONTH(Tabla214[[#This Row],[Fecha_fin_ventas]])-MONTH(Tabla214[[#This Row],[Fecha_inicio_venta]]))))","v":1509},null,null,null,null,null,{"$f":"_xlfn.IFS(AND(Tabla214[[#This Row],[Fecha_inicio_construcción]]<>\"\",Tabla214[[#This Row],[Fecha_fin_construcción]]=\"\"),\"En Construcción\",AND(Tabla214[[#This Row],[Fecha_inicio_construcción]]=\"\",Tabla214[[#This Row],[Fecha_fin_construcción]]=\"\"),\"Tierra\",AND(Tabla214[[#This Row],[Fecha_inicio_construcción]]<>\"\",Tabla214[[#This Row],[Fecha_fin_construcción]]<>\"\"),\"Terminado\",AND(Tabla214[[#This Row],[Fecha_fin_construcción]]<>\"\",Tabla214[[#This Row],[Fecha_inicio_construcción]]=\"\"),\"Falta Fecha:inicio:contruccon\")","v":"Tierra"},{"$f":"IF(IFERROR(INDEX(Tabla1012_1[Inventario_disponible],MATCH(1,(Tabla1012_1[Nombre_desarrollo]=Tabla214[[#This Row],[Nombre_desarrollo]])*(Tabla1012_1[Fecha]=_xlfn.MAXIFS(Tabla1012_1[Fecha],Tabla1012_1[Nombre_desarrollo],Tabla214[[#This Row],[Nombre_desarrollo]])),0)),\"\")=0,\"Vendido\",\"Disponible\")","v":"Disponible"},null,{"$f":"VLOOKUP($A8,[1]Inf_particular_desarrollo!$A$27:$DO$1009,COLUMN([1]Inf_particular_desarrollo!$I$31),FALSE)","v":"Horizontal"}]
["Los Remedios",null,"Sur Poniente","Aurico",null,"Media","Block térmico",1,1,73,10,null,4,"Privado","Caseta de vigilancia","Caseta de vigilancia y guardia",900,"1,2,3,4",null,null,null,null,null,null,null,null,null,null,null,1,0,"$20,000","Si","No","Febrero 2024","Febrero 2024",{"$f":"IF(IFERROR(_xlfn.MINIFS(Tabla1012_1[Fecha],Tabla1012_1[Nombre_desarrollo],Tabla214[[#This Row],[Nombre_desarrollo]],Tabla1012_1[Inventario_disponible],0),\"\")>0,IFERROR(_xlfn.MINIFS(Tabla1012_1[Fecha],Tabla1012_1[Nombre_desarrollo],Tabla214[[#This Row],[Nombre_desarrollo]],Tabla1012_1[Inventario_disponible],0),\"\"),\"\")","v":""},{"$f":"IF(AND(Tabla214[[#This Row],[Fecha_inicio_venta]]=\"\",Tabla214[[#This Row],[Fecha_fin_ventas]]<>\"\"),\"Se necesita fecha_inicio_venta\",IF(AND(Tabla214[[#This Row],[Fecha_inicio_venta]]=\"\",Tabla214[[#This Row],[Fecha_fin_ventas]]=\"\"),\"\",IF(AND(Tabla214[[#This Row],[Fecha_inicio_venta]]<>\"\",Tabla214[[#This Row],[Fecha_fin_ventas]]=\"\"),(YEAR(TODAY())-YEAR(Tabla214[[#This Row],[Fecha_inicio_venta]]))*12 + MONTH(TODAY())-MONTH(Tabla214[[#This Row],[Fecha_inicio_venta]]),(YEAR(Tabla214[[#This Row],[Fecha_fin_ventas]])-YEAR(Tabla214[[#This Row],[Fecha_inicio_venta]]))*12 + MONTH(Tabla214[[#This Row],[Fecha_fin_ventas]])-MONTH(Tabla214[[#This Row],[Fecha_inicio_venta]]))))","v":20},null,null,null,null,null,{"$f":"_xlfn.IFS(AND(Tabla214[[#This Row],[Fecha_inicio_construcción]]<>\"\",Tabla214[[#This Row],[Fecha_fin_construcción]]=\"\"),\"En Construcción\",AND(Tabla214[[#This Row],[Fecha_inicio_construcción]]=\"\",Tabla214[[#This Row],[Fecha_fin_construcción]]=\"\"),\"Tierra\",AND(Tabla214[[#This Row],[Fecha_inicio_construcción]]<>\"\",Tabla214[[#This Row],[Fecha_fin_construcción]]<>\"\"),\"Terminado\",AND(Tabla214[[#This Row],[Fecha_fin_construcción]]<>\"\",Tabla214[[#This Row],[Fecha_inicio_construcción]]=\"\"),\"Falta Fecha:inicio:contruccon\")","v":"Tierra"},{"$f":"IF(IFERROR(INDEX(Tabla1012_1[Inventario_disponible],MATCH(1,(Tabla1012_1[Nombre_desarrollo]=Tabla214[[#This Row],[Nombre_desarrollo]])*(Tabla1012_1[Fecha]=_xlfn.MAXIFS(Tabla1012_1[Fecha],Tabla1012_1[Nombre_desarrollo],Tabla214[[#This Row],[Nombre_desarrollo]])),0)),\"\")=0,\"Vendido\",\"Disponible\")","v":"Disponible"},null,{"$f":"VLOOKUP($A9,[1]Inf_particular_desarrollo!$A$27:$DO$1009,COLUMN([1]Inf_particular_desarrollo!$I$31),FALSE)","v":"Horizontal"}]
["Azura",null,"Nor Poniente","PBC",null,"Media",null,1,1,60,0,null,4,"Privado","Caseta de vigilancia","Caseta de vigilancia y guardia",1000,"1,3,6,11,19,21,49","cancha de padel",null,null,null,null,null,null,null,null,null,null,1,0,"$30,000","Si","No","Enero  2024","Enero  2024",{"$f":"IF(IFERROR(_xlfn.MINIFS(Tabla1012_1[Fecha],Tabla1012_1[Nombre_desarrollo],Tabla214[[#This Row],[Nombre_desarrollo]],Tabla1012_1[Inventario_disponible],0),\"\")>0,IFERROR(_xlfn.MINIFS(Tabla1012_1[Fecha],Tabla1012_1[Nombre_desarrollo],Tabla214[[#This Row],[Nombre_desarrollo]],Tabla1012_1[Inventario_disponible],0),\"\"),\"\")","v":""},{"$f":"IF(AND(Tabla214[[#This Row],[Fecha_inicio_venta]]=\"\",Tabla214[[#This Row],[Fecha_fin_ventas]]<>\"\"),\"Se necesita fecha_inicio_venta\",IF(AND(Tabla214[[#This Row],[Fecha_inicio_venta]]=\"\",Tabla214[[#This Row],[Fecha_fin_ventas]]=\"\"),\"\",IF(AND(Tabla214[[#This Row],[Fecha_inicio_venta]]<>\"\",Tabla214[[#This Row],[Fecha_fin_ventas]]=\"\"),(YEAR(TODAY())-YEAR(Tabla214[[#This Row],[Fecha_inicio_venta]]))*12 + MONTH(TODAY())-MONTH(Tabla214[[#This Row],[Fecha_inicio_venta]]),(YEAR(Tabla214[[#This Row],[Fecha_fin_ventas]])-YEAR(Tabla214[[#This Row],[Fecha_inicio_venta]]))*12 + MONTH(Tabla214[[#This Row],[Fecha_fin_ventas]])-MONTH(Tabla214[[#This Row],[Fecha_inicio_venta]]))))","v":21},null,null,null,null,null,{"$f":"_xlfn.IFS(AND(Tabla214[[#This Row],[Fecha_inicio_construcción]]<>\"\",Tabla214[[#This Row],[Fecha_fin_construcción]]=\"\"),\"En Construcción\",AND(Tabla214[[#This Row],[Fecha_inicio_construcción]]=\"\",Tabla214[[#This Row],[Fecha_fin_construcción]]=\"\"),\"Tierra\",AND(Tabla214[[#This Row],[Fecha_inicio_construcción]]<>\"\",Tabla214[[#This Row],[Fecha_fin_construcción]]<>\"\"),\"Terminado\",AND(Tabla214[[#This Row],[Fecha_fin_construcción]]<>\"\",Tabla214[[#This Row],[Fecha_inicio_construcción]]=\"\"),\"Falta Fecha:inicio:contruccon\")","v":"Tierra"},{"$f":"IF(IFERROR(INDEX(Tabla1012_1[Inventario_disponible],MATCH(1,(Tabla1012_1[Nombre_desarrollo]=Tabla214[[#This Row],[Nombre_desarrollo]])*(Tabla1012_1[Fecha]=_xlfn.MAXIFS(Tabla1012_1[Fecha],Tabla1012_1[Nombre_desarrollo],Tabla214[[#This Row],[Nombre_desarrollo]])),0)),\"\")=0,\"Vendido\",\"Disponible\")","v":"Disponible"},null,{"$f":"VLOOKUP($A10,[1]Inf_particular_desarrollo!$A$27:$DO$1009,COLUMN([1]Inf_particular_desarrollo!$I$31),FALSE)","v":"Horizontal"}]
["Granna Residencial",null,"Poniente","Impulsa",null,"Media",null,4,1,46,8,null,3,"Privado","Caseta de vigilancia","caseta controlada con biometrico y reconocimiento facial, videovigilancia 24/7",750,"1,2,3,4,6,9,11,17,19,24,33","cancha de padel",null,null,null,null,null,null,null,null,null,null,1,0,"$20,000","Si","No","Junio 2024","Junio 2024",{"$f":"IF(IFERROR(_xlfn.MINIFS(Tabla1012_1[Fecha],Tabla1012_1[Nombre_desarrollo],Tabla214[[#This Row],[Nombre_desarrollo]],Tabla1012_1[Inventario_disponible],0),\"\")>0,IFERROR(_xlfn.MINIFS(Tabla1012_1[Fecha],Tabla1012_1[Nombre_desarrollo],Tabla214[[#This Row],[Nombre_desarrollo]],Tabla1012_1[Inventario_disponible],0),\"\"),\"\")","v":""},{"$f":"IF(AND(Tabla214[[#This Row],[Fecha_inicio_venta]]=\"\",Tabla214[[#This Row],[Fecha_fin_ventas]]<>\"\"),\"Se necesita fecha_inicio_venta\",IF(AND(Tabla214[[#This Row],[Fecha_inicio_venta]]=\"\",Tabla214[[#This Row],[Fecha_fin_ventas]]=\"\"),\"\",IF(AND(Tabla214[[#This Row],[Fecha_inicio_venta]]<>\"\",Tabla214[[#This Row],[Fecha_fin_ventas]]=\"\"),(YEAR(TODAY())-YEAR(Tabla214[[#This Row],[Fecha_inicio_venta]]))*12 + MONTH(TODAY())-MONTH(Tabla214[[#This Row],[Fecha_inicio_venta]]),(YEAR(Tabla214[[#This Row],[Fecha_fin_ventas]])-YEAR(Tabla214[[#This Row],[Fecha_inicio_venta]]))*12 + MONTH(Tabla214[[#This Row],[Fecha_fin_ventas]])-MONTH(Tabla214[[#This Row],[Fecha_inicio_venta]]))))","v":16},null,null,null,null,null,{"$f":"_xlfn.IFS(AND(Tabla214[[#This Row],[Fecha_inicio_construcción]]<>\"\",Tabla214[[#This Row],[Fecha_fin_construcción]]=\"\"),\"En Construcción\",AND(Tabla214[[#This Row],[Fecha_inicio_construcción]]=\"\",Tabla214[[#This Row],[Fecha_fin_construcción]]=\"\"),\"Tierra\",AND(Tabla214[[#This Row],[Fecha_inicio_construcción]]<>\"\",Tabla214[[#This Row],[Fecha_fin_construcción]]<>\"\"),\"Terminado\",AND(Tabla214[[#This Row],[Fecha_fin_construcción]]<>\"\",Tabla214[[#This Row],[Fecha_inicio_construcción]]=\"\"),\"Falta Fecha:inicio:contruccon\")","v":"Tierra"},{"$f":"IF(IFERROR(INDEX(Tabla1012_1[Inventario_disponible],MATCH(1,(Tabla1012_1[Nombre_desarrollo]=Tabla214[[#This Row],[Nombre_desarrollo]])*(Tabla1012_1[Fecha]=_xlfn.MAXIFS(Tabla1012_1[Fecha],Tabla1012_1[Nombre_desarrollo],Tabla214[[#This Row],[Nombre_desarrollo]])),0)),\"\")=0,\"Vendido\",\"Disponible\")","v":"Disponible"}]
["La Joya Norte","Presa de jocoqui 207A, Aguascalientes","Nor Poniente","Independiente",null,"Media","Block",1,1,42,0,null,3,"Privado","Caseta de vigilancia","caseta controlada con biometrico y reconocimiento facial, videovigilancia 24/7",750,"",0,null,null,null,null,null,null,null,null,null,null,1,0,20000,"Si","No","Septiembre 2024","Septiembre 2024",{"$f":"IF(IFERROR(_xlfn.MINIFS(Tabla1012_1[Fecha],Tabla1012_1[Nombre_desarrollo],Tabla214[[#This Row],[Nombre_desarrollo]],Tabla1012_1[Inventario_disponible],0),\"\")>0,IFERROR(_xlfn.MINIFS(Tabla1012_1[Fecha],Tabla1012_1[Nombre_desarrollo],Tabla214[[#This Row],[Nombre_desarrollo]],Tabla1012_1[Inventario_disponible],0),\"\"),\"\")","v":""},{"$f":"IF(AND(Tabla214[[#This Row],[Fecha_inicio_venta]]=\"\",Tabla214[[#This Row],[Fecha_fin_ventas]]<>\"\"),\"Se necesita fecha_inicio_venta\",IF(AND(Tabla214[[#This Row],[Fecha_inicio_venta]]=\"\",Tabla214[[#This Row],[Fecha_fin_ventas]]=\"\"),\"\",IF(AND(Tabla214[[#This Row],[Fecha_inicio_venta]]<>\"\",Tabla214[[#This Row],[Fecha_fin_ventas]]=\"\"),(YEAR(TODAY())-YEAR(Tabla214[[#This Row],[Fecha_inicio_venta]]))*12 + MONTH(TODAY())-MONTH(Tabla214[[#This Row],[Fecha_inicio_venta]]),(YEAR(Tabla214[[#This Row],[Fecha_fin_ventas]])-YEAR(Tabla214[[#This Row],[Fecha_inicio_venta]]))*12 + MONTH(Tabla214[[#This Row],[Fecha_fin_ventas]])-MONTH(Tabla214[[#This Row],[Fecha_inicio_venta]]))))","v":13},null,null,null,null,null,{"$f":"_xlfn.IFS(AND(Tabla214[[#This Row],[Fecha_inicio_construcción]]<>\"\",Tabla214[[#This Row],[Fecha_fin_construcción]]=\"\"),\"En Construcción\",AND(Tabla214[[#This Row],[Fecha_inicio_construcción]]=\"\",Tabla214[[#This Row],[Fecha_fin_construcción]]=\"\"),\"Tierra\",AND(Tabla214[[#This Row],[Fecha_inicio_construcción]]<>\"\",Tabla214[[#This Row],[Fecha_fin_construcción]]<>\"\"),\"Terminado\",AND(Tabla214[[#This Row],[Fecha_fin_construcción]]<>\"\",Tabla214[[#This Row],[Fecha_inicio_construcción]]=\"\"),\"Falta Fecha:inicio:contruccon\")","v":"Tierra"},{"$f":"IF(IFERROR(INDEX(Tabla1012_1[Inventario_disponible],MATCH(1,(Tabla1012_1[Nombre_desarrollo]=Tabla214[[#This Row],[Nombre_desarrollo]])*(Tabla1012_1[Fecha]=_xlfn.MAXIFS(Tabla1012_1[Fecha],Tabla1012_1[Nombre_desarrollo],Tabla214[[#This Row],[Nombre_desarrollo]])),0)),\"\")=0,\"Vendido\",\"Disponible\")","v":"Disponible"}]
["Hacienda Nueva","Ave. Camino a Hacienda Nueva, Aguascalientes","Oriente","Impulsa",null,"Media","Ladrillo",1,1,69,7,null,3,"Privado","Caseta de vigilancia","caseta controlada con biometrico y reconocimiento facial, videovigilancia 24/7",1200,"1,2,3,4,11,17,19,24",0,null,null,null,null,null,null,null,null,null,null,1,0,20000,"Si","No","Mayo 2024","Mayo 2024",{"$f":"IF(IFERROR(_xlfn.MINIFS(Tabla1012_1[Fecha],Tabla1012_1[Nombre_desarrollo],Tabla214[[#This Row],[Nombre_desarrollo]],Tabla1012_1[Inventario_disponible],0),\"\")>0,IFERROR(_xlfn.MINIFS(Tabla1012_1[Fecha],Tabla1012_1[Nombre_desarrollo],Tabla214[[#This Row],[Nombre_desarrollo]],Tabla1012_1[Inventario_disponible],0),\"\"),\"\")","v":""},{"$f":"IF(AND(Tabla214[[#This Row],[Fecha_inicio_venta]]=\"\",Tabla214[[#This Row],[Fecha_fin_ventas]]<>\"\"),\"Se necesita fecha_inicio_venta\",IF(AND(Tabla214[[#This Row],[Fecha_inicio_venta]]=\"\",Tabla214[[#This Row],[Fecha_fin_ventas]]=\"\"),\"\",IF(AND(Tabla214[[#This Row],[Fecha_inicio_venta]]<>\"\",Tabla214[[#This Row],[Fecha_fin_ventas]]=\"\"),(YEAR(TODAY())-YEAR(Tabla214[[#This Row],[Fecha_inicio_venta]]))*12 + MONTH(TODAY())-MONTH(Tabla214[[#This Row],[Fecha_inicio_venta]]),(YEAR(Tabla214[[#This Row],[Fecha_fin_ventas]])-YEAR(Tabla214[[#This Row],[Fecha_inicio_venta]]))*12 + MONTH(Tabla214[[#This Row],[Fecha_fin_ventas]])-MONTH(Tabla214[[#This Row],[Fecha_inicio_venta]]))))","v":17},null,null,null,null,null,{"$f":"_xlfn.IFS(AND(Tabla214[[#This Row],[Fecha_inicio_construcción]]<>\"\",Tabla214[[#This Row],[Fecha_fin_construcción]]=\"\"),\"En Construcción\",AND(Tabla214[[#This Row],[Fecha_inicio_construcción]]=\"\",Tabla214[[#This Row],[Fecha_fin_construcción]]=\"\"),\"Tierra\",AND(Tabla214[[#This Row],[Fecha_inicio_construcción]]<>\"\",Tabla214[[#This Row],[Fecha_fin_construcción]]<>\"\"),\"Terminado\",AND(Tabla214[[#This Row],[Fecha_fin_construcción]]<>\"\",Tabla214[[#This Row],[Fecha_inicio_construcción]]=\"\"),\"Falta Fecha:inicio:contruccon\")","v":"Tierra"},{"$f":"IF(IFERROR(INDEX(Tabla1012_1[Inventario_disponible],MATCH(1,(Tabla1012_1[Nombre_desarrollo]=Tabla214[[#This Row],[Nombre_desarrollo]])*(Tabla1012_1[Fecha]=_xlfn.MAXIFS(Tabla1012_1[Fecha],Tabla1012_1[Nombre_desarrollo],Tabla214[[#This Row],[Nombre_desarrollo]])),0)),\"\")=0,\"Vendido\",\"Disponible\")","v":"Disponible"},null,{"$f":"VLOOKUP($A12,[1]Inf_particular_desarrollo!$A$27:$DO$1009,COLUMN([1]Inf_particular_desarrollo!$I$31),FALSE)","v":"Horizontal"}]
["Marengo","av, Paseo de la solidaridad, Aguascalientes","Norte","Aurico",null,"Residencial A","Block",4,1,190,3,null,3,"Privado","Caseta de vigilancia","caseta controlada con biometrico y reconocimiento facial, videovigilancia 24/7",900,"1,2,3,4,6,9,10,11,17,19,24,33",0,null,null,null,2,null,null,null,null,null,null,1,0,20000,"Si","No","Septiembre 2024","Septiembre 2024",{"$f":"IF(IFERROR(_xlfn.MINIFS(Tabla1012_1[Fecha],Tabla1012_1[Nombre_desarrollo],Tabla214[[#This Row],[Nombre_desarrollo]],Tabla1012_1[Inventario_disponible],0),\"\")>0,IFERROR(_xlfn.MINIFS(Tabla1012_1[Fecha],Tabla1012_1[Nombre_desarrollo],Tabla214[[#This Row],[Nombre_desarrollo]],Tabla1012_1[Inventario_disponible],0),\"\"),\"\")","v":""},{"$f":"IF(AND(Tabla214[[#This Row],[Fecha_inicio_venta]]=\"\",Tabla214[[#This Row],[Fecha_fin_ventas]]<>\"\"),\"Se necesita fecha_inicio_venta\",IF(AND(Tabla214[[#This Row],[Fecha_inicio_venta]]=\"\",Tabla214[[#This Row],[Fecha_fin_ventas]]=\"\"),\"\",IF(AND(Tabla214[[#This Row],[Fecha_inicio_venta]]<>\"\",Tabla214[[#This Row],[Fecha_fin_ventas]]=\"\"),(YEAR(TODAY())-YEAR(Tabla214[[#This Row],[Fecha_inicio_venta]]))*12 + MONTH(TODAY())-MONTH(Tabla214[[#This Row],[Fecha_inicio_venta]]),(YEAR(Tabla214[[#This Row],[Fecha_fin_ventas]])-YEAR(Tabla214[[#This Row],[Fecha_inicio_venta]]))*12 + MONTH(Tabla214[[#This Row],[Fecha_fin_ventas]])-MONTH(Tabla214[[#This Row],[Fecha_inicio_venta]]))))","v":13},null,null,null,null,null,{"$f":"_xlfn.IFS(AND(Tabla214[[#This Row],[Fecha_inicio_construcción]]<>\"\",Tabla214[[#This Row],[Fecha_fin_construcción]]=\"\"),\"En Construcción\",AND(Tabla214[[#This Row],[Fecha_inicio_construcción]]=\"\",Tabla214[[#This Row],[Fecha_fin_construcción]]=\"\"),\"Tierra\",AND(Tabla214[[#This Row],[Fecha_inicio_construcción]]<>\"\",Tabla214[[#This Row],[Fecha_fin_construcción]]<>\"\"),\"Terminado\",AND(Tabla214[[#This Row],[Fecha_fin_construcción]]<>\"\",Tabla214[[#This Row],[Fecha_inicio_construcción]]=\"\"),\"Falta Fecha:inicio:contruccon\")","v":"Tierra"},{"$f":"IF(IFERROR(INDEX(Tabla1012_1[Inventario_disponible],MATCH(1,(Tabla1012_1[Nombre_desarrollo]=Tabla214[[#This Row],[Nombre_desarrollo]])*(Tabla1012_1[Fecha]=_xlfn.MAXIFS(Tabla1012_1[Fecha],Tabla1012_1[Nombre_desarrollo],Tabla214[[#This Row],[Nombre_desarrollo]])),0)),\"\")=0,\"Vendido\",\"Disponible\")","v":"Disponible"}]
["Kerarta Residencial","av Paseos de San Gerardo 150","Sur Poniente","Impulsa",null,"Media",null,3,3,72,3,null,3,"Privado","Caseta de vigilancia","Caseta de vigilancia",1200,"3,9,11,19",null,null,null,null,2,null,null,null,null,null,null,1,0,20000,"Si","No","Febrero 2024","Febrero 2024",{"$f":"IF(IFERROR(_xlfn.MINIFS(Tabla1012_1[Fecha],Tabla1012_1[Nombre_desarrollo],Tabla214[[#This Row],[Nombre_desarrollo]],Tabla1012_1[Inventario_disponible],0),\"\")>0,IFERROR(_xlfn.MINIFS(Tabla1012_1[Fecha],Tabla1012_1[Nombre_desarrollo],Tabla214[[#This Row],[Nombre_desarrollo]],Tabla1012_1[Inventario_disponible],0),\"\"),\"\")","v":""},{"$f":"IF(AND(Tabla214[[#This Row],[Fecha_inicio_venta]]=\"\",Tabla214[[#This Row],[Fecha_fin_ventas]]<>\"\"),\"Se necesita fecha_inicio_venta\",IF(AND(Tabla214[[#This Row],[Fecha_inicio_venta]]=\"\",Tabla214[[#This Row],[Fecha_fin_ventas]]=\"\"),\"\",IF(AND(Tabla214[[#This Row],[Fecha_inicio_venta]]<>\"\",Tabla214[[#This Row],[Fecha_fin_ventas]]=\"\"),(YEAR(TODAY())-YEAR(Tabla214[[#This Row],[Fecha_inicio_venta]]))*12 + MONTH(TODAY())-MONTH(Tabla214[[#This Row],[Fecha_inicio_venta]]),(YEAR(Tabla214[[#This Row],[Fecha_fin_ventas]])-YEAR(Tabla214[[#This Row],[Fecha_inicio_venta]]))*12 + MONTH(Tabla214[[#This Row],[Fecha_fin_ventas]])-MONTH(Tabla214[[#This Row],[Fecha_inicio_venta]]))))","v":20},null,null,null,null,null,{"$f":"_xlfn.IFS(AND(Tabla214[[#This Row],[Fecha_inicio_construcción]]<>\"\",Tabla214[[#This Row],[Fecha_fin_construcción]]=\"\"),\"En Construcción\",AND(Tabla214[[#This Row],[Fecha_inicio_construcción]]=\"\",Tabla214[[#This Row],[Fecha_fin_construcción]]=\"\"),\"Tierra\",AND(Tabla214[[#This Row],[Fecha_inicio_construcción]]<>\"\",Tabla214[[#This Row],[Fecha_fin_construcción]]<>\"\"),\"Terminado\",AND(Tabla214[[#This Row],[Fecha_fin_construcción]]<>\"\",Tabla214[[#This Row],[Fecha_inicio_construcción]]=\"\"),\"Falta Fecha:inicio:contruccon\")","v":"Tierra"},{"$f":"IF(IFERROR(INDEX(Tabla1012_1[Inventario_disponible],MATCH(1,(Tabla1012_1[Nombre_desarrollo]=Tabla214[[#This Row],[Nombre_desarrollo]])*(Tabla1012_1[Fecha]=_xlfn.MAXIFS(Tabla1012_1[Fecha],Tabla1012_1[Nombre_desarrollo],Tabla214[[#This Row],[Nombre_desarrollo]])),0)),\"\")=0,\"Vendido\",\"Disponible\")","v":"Disponible"},null,{"$f":"VLOOKUP($A14,[1]Inf_particular_desarrollo!$A$27:$DO$1009,COLUMN([1]Inf_particular_desarrollo!$I$31),FALSE)","v":"Horizontal"}]
["Ciudad Maderas- Hacienda Vista Hermosa","camino sin nombre entronque km50+ carr70 ojuelos, Ags.","Nor Poniente","Impulsa",null,"Económica",null,1,1,116,6,null,2,"Privado","Caseta de vigilancia","Caseta de vigilancia",950,"3,4,6,17,19,26",null,null,null,null,null,null,null,null,null,null,null,{"$error":"#N/A"},{"$error":"#N/A"},{"$error":"#N/A"},{"$error":"#N/A"},{"$error":"#N/A"},"enero 25","enero 25",{"$f":"IF(IFERROR(_xlfn.MINIFS(Tabla1012_1[Fecha],Tabla1012_1[Nombre_desarrollo],Tabla214[[#This Row],[Nombre_desarrollo]],Tabla1012_1[Inventario_disponible],0),\"\")>0,IFERROR(_xlfn.MINIFS(Tabla1012_1[Fecha],Tabla1012_1[Nombre_desarrollo],Tabla214[[#This Row],[Nombre_desarrollo]],Tabla1012_1[Inventario_disponible],0),\"\"),\"\")","v":""},{"$f":"IF(AND(Tabla214[[#This Row],[Fecha_inicio_venta]]=\"\",Tabla214[[#This Row],[Fecha_fin_ventas]]<>\"\"),\"Se necesita fecha_inicio_venta\",IF(AND(Tabla214[[#This Row],[Fecha_inicio_venta]]=\"\",Tabla214[[#This Row],[Fecha_fin_ventas]]=\"\"),\"\",IF(AND(Tabla214[[#This Row],[Fecha_inicio_venta]]<>\"\",Tabla214[[#This Row],[Fecha_fin_ventas]]=\"\"),(YEAR(TODAY())-YEAR(Tabla214[[#This Row],[Fecha_inicio_venta]]))*12 + MONTH(TODAY())-MONTH(Tabla214[[#This Row],[Fecha_inicio_venta]]),(YEAR(Tabla214[[#This Row],[Fecha_fin_ventas]])-YEAR(Tabla214[[#This Row],[Fecha_inicio_venta]]))*12 + MONTH(Tabla214[[#This Row],[Fecha_fin_ventas]])-MONTH(Tabla214[[#This Row],[Fecha_inicio_venta]]))))","v":9},null,null,null,null,null,{"$f":"_xlfn.IFS(AND(Tabla214[[#This Row],[Fecha_inicio_construcción]]<>\"\",Tabla214[[#This Row],[Fecha_fin_construcción]]=\"\"),\"En Construcción\",AND(Tabla214[[#This Row],[Fecha_inicio_construcción]]=\"\",Tabla214[[#This Row],[Fecha_fin_construcción]]=\"\"),\"Tierra\",AND(Tabla214[[#This Row],[Fecha_inicio_construcción]]<>\"\",Tabla214[[#This Row],[Fecha_fin_construcción]]<>\"\"),\"Terminado\",AND(Tabla214[[#This Row],[Fecha_fin_construcción]]<>\"\",Tabla214[[#This Row],[Fecha_inicio_construcción]]=\"\"),\"Falta Fecha:inicio:contruccon\")","v":"Tierra"},{"$f":"IF(IFERROR(INDEX(Tabla1012_1[Inventario_disponible],MATCH(1,(Tabla1012_1[Nombre_desarrollo]=Tabla214[[#This Row],[Nombre_desarrollo]])*(Tabla1012_1[Fecha]=_xlfn.MAXIFS(Tabla1012_1[Fecha],Tabla1012_1[Nombre_desarrollo],Tabla214[[#This Row],[Nombre_desarrollo]])),0)),\"\")=0,\"Vendido\",\"Disponible\")","v":"Disponible"},null,{"$f":"VLOOKUP($A15,[1]Inf_particular_desarrollo!$A$27:$DO$1009,COLUMN([1]Inf_particular_desarrollo!$I$31),FALSE)","v":"Horizontal"}]
["Paseos Levana","Av. 1ro de Diciembre","Nor Poniente","Impulsa",null,"Media",null,1,1,180,15,null,4,"Privado",0,"Caseta de vigilancia y guardia",0,"1,2,3,4,9",null,null,null,null,null,null,null,null,null,null,null,{"$error":"#N/A"},{"$error":"#N/A"},{"$error":"#N/A"},{"$error":"#N/A"},{"$error":"#N/A"},"dic 24","dic 24",{"$f":"IF(IFERROR(_xlfn.MINIFS(Tabla1012_1[Fecha],Tabla1012_1[Nombre_desarrollo],Tabla214[[#This Row],[Nombre_desarrollo]],Tabla1012_1[Inventario_disponible],0),\"\")>0,IFERROR(_xlfn.MINIFS(Tabla1012_1[Fecha],Tabla1012_1[Nombre_desarrollo],Tabla214[[#This Row],[Nombre_desarrollo]],Tabla1012_1[Inventario_disponible],0),\"\"),\"\")","v":""},{"$f":"IF(AND(Tabla214[[#This Row],[Fecha_inicio_venta]]=\"\",Tabla214[[#This Row],[Fecha_fin_ventas]]<>\"\"),\"Se necesita fecha_inicio_venta\",IF(AND(Tabla214[[#This Row],[Fecha_inicio_venta]]=\"\",Tabla214[[#This Row],[Fecha_fin_ventas]]=\"\"),\"\",IF(AND(Tabla214[[#This Row],[Fecha_inicio_venta]]<>\"\",Tabla214[[#This Row],[Fecha_fin_ventas]]=\"\"),(YEAR(TODAY())-YEAR(Tabla214[[#This Row],[Fecha_inicio_venta]]))*12 + MONTH(TODAY())-MONTH(Tabla214[[#This Row],[Fecha_inicio_venta]]),(YEAR(Tabla214[[#This Row],[Fecha_fin_ventas]])-YEAR(Tabla214[[#This Row],[Fecha_inicio_venta]]))*12 + MONTH(Tabla214[[#This Row],[Fecha_fin_ventas]])-MONTH(Tabla214[[#This Row],[Fecha_inicio_venta]]))))","v":10},null,null,null,null,null,{"$f":"_xlfn.IFS(AND(Tabla214[[#This Row],[Fecha_inicio_construcción]]<>\"\",Tabla214[[#This Row],[Fecha_fin_construcción]]=\"\"),\"En Construcción\",AND(Tabla214[[#This Row],[Fecha_inicio_construcción]]=\"\",Tabla214[[#This Row],[Fecha_fin_construcción]]=\"\"),\"Tierra\",AND(Tabla214[[#This Row],[Fecha_inicio_construcción]]<>\"\",Tabla214[[#This Row],[Fecha_fin_construcción]]<>\"\"),\"Terminado\",AND(Tabla214[[#This Row],[Fecha_fin_construcción]]<>\"\",Tabla214[[#This Row],[Fecha_inicio_construcción]]=\"\"),\"Falta Fecha:inicio:contruccon\")","v":"Tierra"},{"$f":"IF(IFERROR(INDEX(Tabla1012_1[Inventario_disponible],MATCH(1,(Tabla1012_1[Nombre_desarrollo]=Tabla214[[#This Row],[Nombre_desarrollo]])*(Tabla1012_1[Fecha]=_xlfn.MAXIFS(Tabla1012_1[Fecha],Tabla1012_1[Nombre_desarrollo],Tabla214[[#This Row],[Nombre_desarrollo]])),0)),\"\")=0,\"Vendido\",\"Disponible\")","v":"Disponible"}]
["Caranday II- Creta","Av Atlantico, Rancho Santa Monica","Sur Poniente","Impulsa",null,"Residencial A",null,5,2,157,2,null,4,"Privado","Caseta de vigilancia","Acceso controlado 24/7",750,"1,2,3,4",0,null,null,null,2,null,null,null,null,null,null,{"$error":"#N/A"},{"$error":"#N/A"},{"$error":"#N/A"},{"$error":"#N/A"},{"$error":"#N/A"},"2025-04-01","2025-04-01",{"$f":"IF(IFERROR(_xlfn.MINIFS(Tabla1012_1[Fecha],Tabla1012_1[Nombre_desarrollo],Tabla214[[#This Row],[Nombre_desarrollo]],Tabla1012_1[Inventario_disponible],0),\"\")>0,IFERROR(_xlfn.MINIFS(Tabla1012_1[Fecha],Tabla1012_1[Nombre_desarrollo],Tabla214[[#This Row],[Nombre_desarrollo]],Tabla1012_1[Inventario_disponible],0),\"\"),\"\")","v":""},{"$f":"IF(AND(Tabla214[[#This Row],[Fecha_inicio_venta]]=\"\",Tabla214[[#This Row],[Fecha_fin_ventas]]<>\"\"),\"Se necesita fecha_inicio_venta\",IF(AND(Tabla214[[#This Row],[Fecha_inicio_venta]]=\"\",Tabla214[[#This Row],[Fecha_fin_ventas]]=\"\"),\"\",IF(AND(Tabla214[[#This Row],[Fecha_inicio_venta]]<>\"\",Tabla214[[#This Row],[Fecha_fin_ventas]]=\"\"),(YEAR(TODAY())-YEAR(Tabla214[[#This Row],[Fecha_inicio_venta]]))*12 + MONTH(TODAY())-MONTH(Tabla214[[#This Row],[Fecha_inicio_venta]]),(YEAR(Tabla214[[#This Row],[Fecha_fin_ventas]])-YEAR(Tabla214[[#This Row],[Fecha_inicio_venta]]))*12 + MONTH(Tabla214[[#This Row],[Fecha_fin_ventas]])-MONTH(Tabla214[[#This Row],[Fecha_inicio_venta]]))))","v":6},null,null,null,null,null,{"$f":"_xlfn.IFS(AND(Tabla214[[#This Row],[Fecha_inicio_construcción]]<>\"\",Tabla214[[#This Row],[Fecha_fin_construcción]]=\"\"),\"En Construcción\",AND(Tabla214[[#This Row],[Fecha_inicio_construcción]]=\"\",Tabla214[[#This Row],[Fecha_fin_construcción]]=\"\"),\"Tierra\",AND(Tabla214[[#This Row],[Fecha_inicio_construcción]]<>\"\",Tabla214[[#This Row],[Fecha_fin_construcción]]<>\"\"),\"Terminado\",AND(Tabla214[[#This Row],[Fecha_fin_construcción]]<>\"\",Tabla214[[#This Row],[Fecha_inicio_construcción]]=\"\"),\"Falta Fecha:inicio:contruccon\")","v":"Tierra"},{"$f":"IF(IFERROR(INDEX(Tabla1012_1[Inventario_disponible],MATCH(1,(Tabla1012_1[Nombre_desarrollo]=Tabla214[[#This Row],[Nombre_desarrollo]])*(Tabla1012_1[Fecha]=_xlfn.MAXIFS(Tabla1012_1[Fecha],Tabla1012_1[Nombre_desarrollo],Tabla214[[#This Row],[Nombre_desarrollo]])),0)),\"\")=0,\"Vendido\",\"Disponible\")","v":"Disponible"},null,{"$f":"VLOOKUP($A17,[1]Inf_particular_desarrollo!$A$27:$DO$1009,COLUMN([1]Inf_particular_desarrollo!$I$31),FALSE)","v":"Horizontal"}]
["Amura- Etapa 3","Av. Atlantico Sn. Rancho Santa Monica","Sur Poniente","Grupo San Cristobal",null,"Residencial A","Block",1,1,39,4,null,3,"Privado","Caseta de Vigilancia","Caseta de vigilancia",null,"1,2,3,4,5,49",null,null,null,null,null,null,null,null,null,null,null,{"$error":"#N/A"},{"$error":"#N/A"},{"$error":"#N/A"},{"$error":"#N/A"},{"$error":"#N/A"},"marzo 25","marzo 25",{"$f":"IF(IFERROR(_xlfn.MINIFS(Tabla1012_1[Fecha],Tabla1012_1[Nombre_desarrollo],Tabla214[[#This Row],[Nombre_desarrollo]],Tabla1012_1[Inventario_disponible],0),\"\")>0,IFERROR(_xlfn.MINIFS(Tabla1012_1[Fecha],Tabla1012_1[Nombre_desarrollo],Tabla214[[#This Row],[Nombre_desarrollo]],Tabla1012_1[Inventario_disponible],0),\"\"),\"\")","v":""},{"$f":"IF(AND(Tabla214[[#This Row],[Fecha_inicio_venta]]=\"\",Tabla214[[#This Row],[Fecha_fin_ventas]]<>\"\"),\"Se necesita fecha_inicio_venta\",IF(AND(Tabla214[[#This Row],[Fecha_inicio_venta]]=\"\",Tabla214[[#This Row],[Fecha_fin_ventas]]=\"\"),\"\",IF(AND(Tabla214[[#This Row],[Fecha_inicio_venta]]<>\"\",Tabla214[[#This Row],[Fecha_fin_ventas]]=\"\"),(YEAR(TODAY())-YEAR(Tabla214[[#This Row],[Fecha_inicio_venta]]))*12 + MONTH(TODAY())-MONTH(Tabla214[[#This Row],[Fecha_inicio_venta]]),(YEAR(Tabla214[[#This Row],[Fecha_fin_ventas]])-YEAR(Tabla214[[#This Row],[Fecha_inicio_venta]]))*12 + MONTH(Tabla214[[#This Row],[Fecha_fin_ventas]])-MONTH(Tabla214[[#This Row],[Fecha_inicio_venta]]))))","v":7},null,null,null,null,null,{"$f":"_xlfn.IFS(AND(Tabla214[[#This Row],[Fecha_inicio_construcción]]<>\"\",Tabla214[[#This Row],[Fecha_fin_construcción]]=\"\"),\"En Construcción\",AND(Tabla214[[#This Row],[Fecha_inicio_construcción]]=\"\",Tabla214[[#This Row],[Fecha_fin_construcción]]=\"\"),\"Tierra\",AND(Tabla214[[#This Row],[Fecha_inicio_construcción]]<>\"\",Tabla214[[#This Row],[Fecha_fin_construcción]]<>\"\"),\"Terminado\",AND(Tabla214[[#This Row],[Fecha_fin_construcción]]<>\"\",Tabla214[[#This Row],[Fecha_inicio_construcción]]=\"\"),\"Falta Fecha:inicio:contruccon\")","v":"Tierra"},{"$f":"IF(IFERROR(INDEX(Tabla1012_1[Inventario_disponible],MATCH(1,(Tabla1012_1[Nombre_desarrollo]=Tabla214[[#This Row],[Nombre_desarrollo]])*(Tabla1012_1[Fecha]=_xlfn.MAXIFS(Tabla1012_1[Fecha],Tabla1012_1[Nombre_desarrollo],Tabla214[[#This Row],[Nombre_desarrollo]])),0)),\"\")=0,\"Vendido\",\"Disponible\")","v":"Disponible"}]
["Amandra","Blvd Lopez mateos 902","norte","Terrahome",null,0,0,1,1,68,4,null,3,"Privado","Caseta de vigilancia","Caseta de vigilancia","No habra","1,2,3,4,19,27",null,null,null,null,2,null,null,null,null,null,null,1,0,30000,"Si","No","nov 24","nov 24",{"$f":"IF(IFERROR(_xlfn.MINIFS(Tabla1012_1[Fecha],Tabla1012_1[Nombre_desarrollo],Tabla214[[#This Row],[Nombre_desarrollo]],Tabla1012_1[Inventario_disponible],0),\"\")>0,IFERROR(_xlfn.MINIFS(Tabla1012_1[Fecha],Tabla1012_1[Nombre_desarrollo],Tabla214[[#This Row],[Nombre_desarrollo]],Tabla1012_1[Inventario_disponible],0),\"\"),\"\")","v":""},{"$f":"IF(AND(Tabla214[[#This Row],[Fecha_inicio_venta]]=\"\",Tabla214[[#This Row],[Fecha_fin_ventas]]<>\"\"),\"Se necesita fecha_inicio_venta\",IF(AND(Tabla214[[#This Row],[Fecha_inicio_venta]]=\"\",Tabla214[[#This Row],[Fecha_fin_ventas]]=\"\"),\"\",IF(AND(Tabla214[[#This Row],[Fecha_inicio_venta]]<>\"\",Tabla214[[#This Row],[Fecha_fin_ventas]]=\"\"),(YEAR(TODAY())-YEAR(Tabla214[[#This Row],[Fecha_inicio_venta]]))*12 + MONTH(TODAY())-MONTH(Tabla214[[#This Row],[Fecha_inicio_venta]]),(YEAR(Tabla214[[#This Row],[Fecha_fin_ventas]])-YEAR(Tabla214[[#This Row],[Fecha_inicio_venta]]))*12 + MONTH(Tabla214[[#This Row],[Fecha_fin_ventas]])-MONTH(Tabla214[[#This Row],[Fecha_inicio_venta]]))))","v":11},null,null,null,null,null,{"$f":"_xlfn.IFS(AND(Tabla214[[#This Row],[Fecha_inicio_construcción]]<>\"\",Tabla214[[#This Row],[Fecha_fin_construcción]]=\"\"),\"En Construcción\",AND(Tabla214[[#This Row],[Fecha_inicio_construcción]]=\"\",Tabla214[[#This Row],[Fecha_fin_construcción]]=\"\"),\"Tierra\",AND(Tabla214[[#This Row],[Fecha_inicio_construcción]]<>\"\",Tabla214[[#This Row],[Fecha_fin_construcción]]<>\"\"),\"Terminado\",AND(Tabla214[[#This Row],[Fecha_fin_construcción]]<>\"\",Tabla214[[#This Row],[Fecha_inicio_construcción]]=\"\"),\"Falta Fecha:inicio:contruccon\")","v":"Tierra"},{"$f":"IF(IFERROR(INDEX(Tabla1012_1[Inventario_disponible],MATCH(1,(Tabla1012_1[Nombre_desarrollo]=Tabla214[[#This Row],[Nombre_desarrollo]])*(Tabla1012_1[Fecha]=_xlfn.MAXIFS(Tabla1012_1[Fecha],Tabla1012_1[Nombre_desarrollo],Tabla214[[#This Row],[Nombre_desarrollo]])),0)),\"\")=0,\"Vendido\",\"Disponible\")","v":"Disponible"}]
["Carena Cluster 5",null,"Poniente","Javer",null,"Media","Block",3,3,106,6,null,2,"Privado","Caseta de vigilancia",0,null,"3,9,18,19,26","Ecenario exterior y muro de Rapel.",null,null,null,2,null,null,null,null,null,null,{"$error":"#N/A"},{"$error":"#N/A"},{"$error":"#N/A"},{"$error":"#N/A"},{"$error":"#N/A"},"Julio 2025","Julio 2025",{"$f":"IF(IFERROR(_xlfn.MINIFS(Tabla1012_1[Fecha],Tabla1012_1[Nombre_desarrollo],Tabla214[[#This Row],[Nombre_desarrollo]],Tabla1012_1[Inventario_disponible],0),\"\")>0,IFERROR(_xlfn.MINIFS(Tabla1012_1[Fecha],Tabla1012_1[Nombre_desarrollo],Tabla214[[#This Row],[Nombre_desarrollo]],Tabla1012_1[Inventario_disponible],0),\"\"),\"\")","v":""},{"$f":"IF(AND(Tabla214[[#This Row],[Fecha_inicio_venta]]=\"\",Tabla214[[#This Row],[Fecha_fin_ventas]]<>\"\"),\"Se necesita fecha_inicio_venta\",IF(AND(Tabla214[[#This Row],[Fecha_inicio_venta]]=\"\",Tabla214[[#This Row],[Fecha_fin_ventas]]=\"\"),\"\",IF(AND(Tabla214[[#This Row],[Fecha_inicio_venta]]<>\"\",Tabla214[[#This Row],[Fecha_fin_ventas]]=\"\"),(YEAR(TODAY())-YEAR(Tabla214[[#This Row],[Fecha_inicio_venta]]))*12 + MONTH(TODAY())-MONTH(Tabla214[[#This Row],[Fecha_inicio_venta]]),(YEAR(Tabla214[[#This Row],[Fecha_fin_ventas]])-YEAR(Tabla214[[#This Row],[Fecha_inicio_venta]]))*12 + MONTH(Tabla214[[#This Row],[Fecha_fin_ventas]])-MONTH(Tabla214[[#This Row],[Fecha_inicio_venta]]))))","v":3},null,null,null,null,null,{"$f":"_xlfn.IFS(AND(Tabla214[[#This Row],[Fecha_inicio_construcción]]<>\"\",Tabla214[[#This Row],[Fecha_fin_construcción]]=\"\"),\"En Construcción\",AND(Tabla214[[#This Row],[Fecha_inicio_construcción]]=\"\",Tabla214[[#This Row],[Fecha_fin_construcción]]=\"\"),\"Tierra\",AND(Tabla214[[#This Row],[Fecha_inicio_construcción]]<>\"\",Tabla214[[#This Row],[Fecha_fin_construcción]]<>\"\"),\"Terminado\",AND(Tabla214[[#This Row],[Fecha_fin_construcción]]<>\"\",Tabla214[[#This Row],[Fecha_inicio_construcción]]=\"\"),\"Falta Fecha:inicio:contruccon\")","v":"Tierra"},{"$f":"IF(IFERROR(INDEX(Tabla1012_1[Inventario_disponible],MATCH(1,(Tabla1012_1[Nombre_desarrollo]=Tabla214[[#This Row],[Nombre_desarrollo]])*(Tabla1012_1[Fecha]=_xlfn.MAXIFS(Tabla1012_1[Fecha],Tabla1012_1[Nombre_desarrollo],Tabla214[[#This Row],[Nombre_desarrollo]])),0)),\"\")=0,\"Vendido\",\"Disponible\")","v":"Disponible"}]
["Moranza ","Paseo de la Moranza 102, Av camino a hacienda nueva","Nor Poniente","GCPeasa",null,0,null,1,1,131,0,null,4,"Privado","Caseta de vigilancia","Caseta de vigilancia y guardia",900,"1,2,4,6,11,17,19",null,null,null,null,null,null,null,null,null,null,null,1,0,20000,"Si","No","feb25","feb25",{"$f":"IF(IFERROR(_xlfn.MINIFS(Tabla1012_1[Fecha],Tabla1012_1[Nombre_desarrollo],Tabla214[[#This Row],[Nombre_desarrollo]],Tabla1012_1[Inventario_disponible],0),\"\")>0,IFERROR(_xlfn.MINIFS(Tabla1012_1[Fecha],Tabla1012_1[Nombre_desarrollo],Tabla214[[#This Row],[Nombre_desarrollo]],Tabla1012_1[Inventario_disponible],0),\"\"),\"\")","v":""},{"$f":"IF(AND(Tabla214[[#This Row],[Fecha_inicio_venta]]=\"\",Tabla214[[#This Row],[Fecha_fin_ventas]]<>\"\"),\"Se necesita fecha_inicio_venta\",IF(AND(Tabla214[[#This Row],[Fecha_inicio_venta]]=\"\",Tabla214[[#This Row],[Fecha_fin_ventas]]=\"\"),\"\",IF(AND(Tabla214[[#This Row],[Fecha_inicio_venta]]<>\"\",Tabla214[[#This Row],[Fecha_fin_ventas]]=\"\"),(YEAR(TODAY())-YEAR(Tabla214[[#This Row],[Fecha_inicio_venta]]))*12 + MONTH(TODAY())-MONTH(Tabla214[[#This Row],[Fecha_inicio_venta]]),(YEAR(Tabla214[[#This Row],[Fecha_fin_ventas]])-YEAR(Tabla214[[#This Row],[Fecha_inicio_venta]]))*12 + MONTH(Tabla214[[#This Row],[Fecha_fin_ventas]])-MONTH(Tabla214[[#This Row],[Fecha_inicio_venta]]))))","v":8},null,null,null,null,null,{"$f":"_xlfn.IFS(AND(Tabla214[[#This Row],[Fecha_inicio_construcción]]<>\"\",Tabla214[[#This Row],[Fecha_fin_construcción]]=\"\"),\"En Construcción\",AND(Tabla214[[#This Row],[Fecha_inicio_construcción]]=\"\",Tabla214[[#This Row],[Fecha_fin_construcción]]=\"\"),\"Tierra\",AND(Tabla214[[#This Row],[Fecha_inicio_construcción]]<>\"\",Tabla214[[#This Row],[Fecha_fin_construcción]]<>\"\"),\"Terminado\",AND(Tabla214[[#This Row],[Fecha_fin_construcción]]<>\"\",Tabla214[[#This Row],[Fecha_inicio_construcción]]=\"\"),\"Falta Fecha:inicio:contruccon\")","v":"Tierra"},{"$f":"IF(IFERROR(INDEX(Tabla1012_1[Inventario_disponible],MATCH(1,(Tabla1012_1[Nombre_desarrollo]=Tabla214[[#This Row],[Nombre_desarrollo]])*(Tabla1012_1[Fecha]=_xlfn.MAXIFS(Tabla1012_1[Fecha],Tabla1012_1[Nombre_desarrollo],Tabla214[[#This Row],[Nombre_desarrollo]])),0)),\"\")=0,\"Vendido\",\"Disponible\")","v":"Disponible"}]
["Puerto Madero","ponciano Arriaga 322, trojes de alonso","Norte","Impulsa",null,0,null,1,1,33,3,null,3.1,"Privado","Caseta de vigilancia",0,950,"",0,null,null,null,null,null,null,null,null,null,null,0,7,30000,"Si","No","Enero 2025","Enero 2025",{"$f":"IF(IFERROR(_xlfn.MINIFS(Tabla1012_1[Fecha],Tabla1012_1[Nombre_desarrollo],Tabla214[[#This Row],[Nombre_desarrollo]],Tabla1012_1[Inventario_disponible],0),\"\")>0,IFERROR(_xlfn.MINIFS(Tabla1012_1[Fecha],Tabla1012_1[Nombre_desarrollo],Tabla214[[#This Row],[Nombre_desarrollo]],Tabla1012_1[Inventario_disponible],0),\"\"),\"\")","v":""},{"$f":"IF(AND(Tabla214[[#This Row],[Fecha_inicio_venta]]=\"\",Tabla214[[#This Row],[Fecha_fin_ventas]]<>\"\"),\"Se necesita fecha_inicio_venta\",IF(AND(Tabla214[[#This Row],[Fecha_inicio_venta]]=\"\",Tabla214[[#This Row],[Fecha_fin_ventas]]=\"\"),\"\",IF(AND(Tabla214[[#This Row],[Fecha_inicio_venta]]<>\"\",Tabla214[[#This Row],[Fecha_fin_ventas]]=\"\"),(YEAR(TODAY())-YEAR(Tabla214[[#This Row],[Fecha_inicio_venta]]))*12 + MONTH(TODAY())-MONTH(Tabla214[[#This Row],[Fecha_inicio_venta]]),(YEAR(Tabla214[[#This Row],[Fecha_fin_ventas]])-YEAR(Tabla214[[#This Row],[Fecha_inicio_venta]]))*12 + MONTH(Tabla214[[#This Row],[Fecha_fin_ventas]])-MONTH(Tabla214[[#This Row],[Fecha_inicio_venta]]))))","v":9},null,null,null,null,null,{"$f":"_xlfn.IFS(AND(Tabla214[[#This Row],[Fecha_inicio_construcción]]<>\"\",Tabla214[[#This Row],[Fecha_fin_construcción]]=\"\"),\"En Construcción\",AND(Tabla214[[#This Row],[Fecha_inicio_construcción]]=\"\",Tabla214[[#This Row],[Fecha_fin_construcción]]=\"\"),\"Tierra\",AND(Tabla214[[#This Row],[Fecha_inicio_construcción]]<>\"\",Tabla214[[#This Row],[Fecha_fin_construcción]]<>\"\"),\"Terminado\",AND(Tabla214[[#This Row],[Fecha_fin_construcción]]<>\"\",Tabla214[[#This Row],[Fecha_inicio_construcción]]=\"\"),\"Falta Fecha:inicio:contruccon\")","v":"Tierra"},{"$f":"IF(IFERROR(INDEX(Tabla1012_1[Inventario_disponible],MATCH(1,(Tabla1012_1[Nombre_desarrollo]=Tabla214[[#This Row],[Nombre_desarrollo]])*(Tabla1012_1[Fecha]=_xlfn.MAXIFS(Tabla1012_1[Fecha],Tabla1012_1[Nombre_desarrollo],Tabla214[[#This Row],[Nombre_desarrollo]])),0)),\"\")=0,\"Vendido\",\"Disponible\")","v":"Disponible"}]
["Amaya","JOSE LOPEZ PORTILLO 601 EL LLANO","Poniente",{"$error":"#N/A"},null,0,0,1,1,114,12,null,4,"Privado","Caseta de vigilancia","Caseta de vigilancia y guardia",1450,"1,2,4,6,11,17,19",null,null,null,null,null,null,null,null,null,null,null,1,0,20000,"Si","No","Febrero 2025","Febrero 2025",{"$f":"IF(IFERROR(_xlfn.MINIFS(Tabla1012_1[Fecha],Tabla1012_1[Nombre_desarrollo],Tabla214[[#This Row],[Nombre_desarrollo]],Tabla1012_1[Inventario_disponible],0),\"\")>0,IFERROR(_xlfn.MINIFS(Tabla1012_1[Fecha],Tabla1012_1[Nombre_desarrollo],Tabla214[[#This Row],[Nombre_desarrollo]],Tabla1012_1[Inventario_disponible],0),\"\"),\"\")","v":""},{"$f":"IF(AND(Tabla214[[#This Row],[Fecha_inicio_venta]]=\"\",Tabla214[[#This Row],[Fecha_fin_ventas]]<>\"\"),\"Se necesita fecha_inicio_venta\",IF(AND(Tabla214[[#This Row],[Fecha_inicio_venta]]=\"\",Tabla214[[#This Row],[Fecha_fin_ventas]]=\"\"),\"\",IF(AND(Tabla214[[#This Row],[Fecha_inicio_venta]]<>\"\",Tabla214[[#This Row],[Fecha_fin_ventas]]=\"\"),(YEAR(TODAY())-YEAR(Tabla214[[#This Row],[Fecha_inicio_venta]]))*12 + MONTH(TODAY())-MONTH(Tabla214[[#This Row],[Fecha_inicio_venta]]),(YEAR(Tabla214[[#This Row],[Fecha_fin_ventas]])-YEAR(Tabla214[[#This Row],[Fecha_inicio_venta]]))*12 + MONTH(Tabla214[[#This Row],[Fecha_fin_ventas]])-MONTH(Tabla214[[#This Row],[Fecha_inicio_venta]]))))","v":8},null,null,null,null,null,{"$f":"_xlfn.IFS(AND(Tabla214[[#This Row],[Fecha_inicio_construcción]]<>\"\",Tabla214[[#This Row],[Fecha_fin_construcción]]=\"\"),\"En Construcción\",AND(Tabla214[[#This Row],[Fecha_inicio_construcción]]=\"\",Tabla214[[#This Row],[Fecha_fin_construcción]]=\"\"),\"Tierra\",AND(Tabla214[[#This Row],[Fecha_inicio_construcción]]<>\"\",Tabla214[[#This Row],[Fecha_fin_construcción]]<>\"\"),\"Terminado\",AND(Tabla214[[#This Row],[Fecha_fin_construcción]]<>\"\",Tabla214[[#This Row],[Fecha_inicio_construcción]]=\"\"),\"Falta Fecha:inicio:contruccon\")","v":"Tierra"},{"$f":"IF(IFERROR(INDEX(Tabla1012_1[Inventario_disponible],MATCH(1,(Tabla1012_1[Nombre_desarrollo]=Tabla214[[#This Row],[Nombre_desarrollo]])*(Tabla1012_1[Fecha]=_xlfn.MAXIFS(Tabla1012_1[Fecha],Tabla1012_1[Nombre_desarrollo],Tabla214[[#This Row],[Nombre_desarrollo]])),0)),\"\")=0,\"Vendido\",\"Disponible\")","v":"Disponible"}]
["La Perla Norte Lotes","Av. Perla Norte 111","Nor Oriente","Aurico",null,0,"Ladrillo",1,1,44,9,null,4,"Privado","Caseta de vigilancia","Caseta de vigilancia y guardia",1400,"1,2,4,6,11,17,19",null,null,null,null,null,null,null,null,null,null,null,1,0,25000,"Si","No","Febrero 2025","Febrero 2025",{"$f":"IF(IFERROR(_xlfn.MINIFS(Tabla1012_1[Fecha],Tabla1012_1[Nombre_desarrollo],Tabla214[[#This Row],[Nombre_desarrollo]],Tabla1012_1[Inventario_disponible],0),\"\")>0,IFERROR(_xlfn.MINIFS(Tabla1012_1[Fecha],Tabla1012_1[Nombre_desarrollo],Tabla214[[#This Row],[Nombre_desarrollo]],Tabla1012_1[Inventario_disponible],0),\"\"),\"\")","v":""},{"$f":"IF(AND(Tabla214[[#This Row],[Fecha_inicio_venta]]=\"\",Tabla214[[#This Row],[Fecha_fin_ventas]]<>\"\"),\"Se necesita fecha_inicio_venta\",IF(AND(Tabla214[[#This Row],[Fecha_inicio_venta]]=\"\",Tabla214[[#This Row],[Fecha_fin_ventas]]=\"\"),\"\",IF(AND(Tabla214[[#This Row],[Fecha_inicio_venta]]<>\"\",Tabla214[[#This Row],[Fecha_fin_ventas]]=\"\"),(YEAR(TODAY())-YEAR(Tabla214[[#This Row],[Fecha_inicio_venta]]))*12 + MONTH(TODAY())-MONTH(Tabla214[[#This Row],[Fecha_inicio_venta]]),(YEAR(Tabla214[[#This Row],[Fecha_fin_ventas]])-YEAR(Tabla214[[#This Row],[Fecha_inicio_venta]]))*12 + MONTH(Tabla214[[#This Row],[Fecha_fin_ventas]])-MONTH(Tabla214[[#This Row],[Fecha_inicio_venta]]))))","v":8},null,null,null,null,null,{"$f":"_xlfn.IFS(AND(Tabla214[[#This Row],[Fecha_inicio_construcción]]<>\"\",Tabla214[[#This Row],[Fecha_fin_construcción]]=\"\"),\"En Construcción\",AND(Tabla214[[#This Row],[Fecha_inicio_construcción]]=\"\",Tabla214[[#This Row],[Fecha_fin_construcción]]=\"\"),\"Tierra\",AND(Tabla214[[#This Row],[Fecha_inicio_construcción]]<>\"\",Tabla214[[#This Row],[Fecha_fin_construcción]]<>\"\"),\"Terminado\",AND(Tabla214[[#This Row],[Fecha_fin_construcción]]<>\"\",Tabla214[[#This Row],[Fecha_inicio_construcción]]=\"\"),\"Falta Fecha:inicio:contruccon\")","v":"Tierra"},{"$f":"IF(IFERROR(INDEX(Tabla1012_1[Inventario_disponible],MATCH(1,(Tabla1012_1[Nombre_desarrollo]=Tabla214[[#This Row],[Nombre_desarrollo]])*(Tabla1012_1[Fecha]=_xlfn.MAXIFS(Tabla1012_1[Fecha],Tabla1012_1[Nombre_desarrollo],Tabla214[[#This Row],[Nombre_desarrollo]])),0)),\"\")=0,\"Vendido\",\"Disponible\")","v":"Disponible"}]
["Cholula 665 ","larreategui 665","Centro","Impulsa",null,0,null,2,1,6,3,null,4,"Privado","Caseta de vigilancia",0,"aun no establecido","",0,null,null,null,1,null,null,null,null,null,null,1,0,20000,"Si","No","enero 25","enero 25",{"$f":"IF(IFERROR(_xlfn.MINIFS(Tabla1012_1[Fecha],Tabla1012_1[Nombre_desarrollo],Tabla214[[#This Row],[Nombre_desarrollo]],Tabla1012_1[Inventario_disponible],0),\"\")>0,IFERROR(_xlfn.MINIFS(Tabla1012_1[Fecha],Tabla1012_1[Nombre_desarrollo],Tabla214[[#This Row],[Nombre_desarrollo]],Tabla1012_1[Inventario_disponible],0),\"\"),\"\")","v":""},{"$f":"IF(AND(Tabla214[[#This Row],[Fecha_inicio_venta]]=\"\",Tabla214[[#This Row],[Fecha_fin_ventas]]<>\"\"),\"Se necesita fecha_inicio_venta\",IF(AND(Tabla214[[#This Row],[Fecha_inicio_venta]]=\"\",Tabla214[[#This Row],[Fecha_fin_ventas]]=\"\"),\"\",IF(AND(Tabla214[[#This Row],[Fecha_inicio_venta]]<>\"\",Tabla214[[#This Row],[Fecha_fin_ventas]]=\"\"),(YEAR(TODAY())-YEAR(Tabla214[[#This Row],[Fecha_inicio_venta]]))*12 + MONTH(TODAY())-MONTH(Tabla214[[#This Row],[Fecha_inicio_venta]]),(YEAR(Tabla214[[#This Row],[Fecha_fin_ventas]])-YEAR(Tabla214[[#This Row],[Fecha_inicio_venta]]))*12 + MONTH(Tabla214[[#This Row],[Fecha_fin_ventas]])-MONTH(Tabla214[[#This Row],[Fecha_inicio_venta]]))))","v":9},null,null,null,null,null,{"$f":"_xlfn.IFS(AND(Tabla214[[#This Row],[Fecha_inicio_construcción]]<>\"\",Tabla214[[#This Row],[Fecha_fin_construcción]]=\"\"),\"En Construcción\",AND(Tabla214[[#This Row],[Fecha_inicio_construcción]]=\"\",Tabla214[[#This Row],[Fecha_fin_construcción]]=\"\"),\"Tierra\",AND(Tabla214[[#This Row],[Fecha_inicio_construcción]]<>\"\",Tabla214[[#This Row],[Fecha_fin_construcción]]<>\"\"),\"Terminado\",AND(Tabla214[[#This Row],[Fecha_fin_construcción]]<>\"\",Tabla214[[#This Row],[Fecha_inicio_construcción]]=\"\"),\"Falta Fecha:inicio:contruccon\")","v":"Tierra"},{"$f":"IF(IFERROR(INDEX(Tabla1012_1[Inventario_disponible],MATCH(1,(Tabla1012_1[Nombre_desarrollo]=Tabla214[[#This Row],[Nombre_desarrollo]])*(Tabla1012_1[Fecha]=_xlfn.MAXIFS(Tabla1012_1[Fecha],Tabla1012_1[Nombre_desarrollo],Tabla214[[#This Row],[Nombre_desarrollo]])),0)),\"\")=0,\"Vendido\",\"Disponible\")","v":"Disponible"}]
["Cholula 665- Etapa 2","larreategui 665","Centro","Impulsa",null,0,null,2,2,28,4,null,4,"Privado","Caseta de vigilancia",0,"aun no establecido","",0,null,null,null,1,null,null,null,null,null,null,1,0,20000,"Si","No","junio 25","junio 25",{"$f":"IF(IFERROR(_xlfn.MINIFS(Tabla1012_1[Fecha],Tabla1012_1[Nombre_desarrollo],Tabla214[[#This Row],[Nombre_desarrollo]],Tabla1012_1[Inventario_disponible],0),\"\")>0,IFERROR(_xlfn.MINIFS(Tabla1012_1[Fecha],Tabla1012_1[Nombre_desarrollo],Tabla214[[#This Row],[Nombre_desarrollo]],Tabla1012_1[Inventario_disponible],0),\"\"),\"\")","v":""},{"$f":"IF(AND(Tabla214[[#This Row],[Fecha_inicio_venta]]=\"\",Tabla214[[#This Row],[Fecha_fin_ventas]]<>\"\"),\"Se necesita fecha_inicio_venta\",IF(AND(Tabla214[[#This Row],[Fecha_inicio_venta]]=\"\",Tabla214[[#This Row],[Fecha_fin_ventas]]=\"\"),\"\",IF(AND(Tabla214[[#This Row],[Fecha_inicio_venta]]<>\"\",Tabla214[[#This Row],[Fecha_fin_ventas]]=\"\"),(YEAR(TODAY())-YEAR(Tabla214[[#This Row],[Fecha_inicio_venta]]))*12 + MONTH(TODAY())-MONTH(Tabla214[[#This Row],[Fecha_inicio_venta]]),(YEAR(Tabla214[[#This Row],[Fecha_fin_ventas]])-YEAR(Tabla214[[#This Row],[Fecha_inicio_venta]]))*12 + MONTH(Tabla214[[#This Row],[Fecha_fin_ventas]])-MONTH(Tabla214[[#This Row],[Fecha_inicio_venta]]))))","v":4},null,null,null,null,null,{"$f":"_xlfn.IFS(AND(Tabla214[[#This Row],[Fecha_inicio_construcción]]<>\"\",Tabla214[[#This Row],[Fecha_fin_construcción]]=\"\"),\"En Construcción\",AND(Tabla214[[#This Row],[Fecha_inicio_construcción]]=\"\",Tabla214[[#This Row],[Fecha_fin_construcción]]=\"\"),\"Tierra\",AND(Tabla214[[#This Row],[Fecha_inicio_construcción]]<>\"\",Tabla214[[#This Row],[Fecha_fin_construcción]]<>\"\"),\"Terminado\",AND(Tabla214[[#This Row],[Fecha_fin_construcción]]<>\"\",Tabla214[[#This Row],[Fecha_inicio_construcción]]=\"\"),\"Falta Fecha:inicio:contruccon\")","v":"Tierra"},{"$f":"IF(IFERROR(INDEX(Tabla1012_1[Inventario_disponible],MATCH(1,(Tabla1012_1[Nombre_desarrollo]=Tabla214[[#This Row],[Nombre_desarrollo]])*(Tabla1012_1[Fecha]=_xlfn.MAXIFS(Tabla1012_1[Fecha],Tabla1012_1[Nombre_desarrollo],Tabla214[[#This Row],[Nombre_desarrollo]])),0)),\"\")=0,\"Vendido\",\"Disponible\")","v":"Disponible"},null,{"$f":"VLOOKUP(#REF!,[1]Inf_particular_desarrollo!$A$27:$DO$1009,COLUMN([1]Inf_particular_desarrollo!$I$31),FALSE)","v":{"$error":"#REF!"}}]
["Hacienda el Cobano -Cedro Blanco","Camino al Cobano","Nor Oriente","Impulsa",null,null,null,1,1,39,3,null,3,"Privado","Caseta de vigilancia","Caseta de vigilancia","$ ","",null,null,null,null,2,null,null,null,null,null,null,0,15,15000,"No","No","febrero 25","febrero 25",{"$f":"IF(IFERROR(_xlfn.MINIFS(Tabla1012_1[Fecha],Tabla1012_1[Nombre_desarrollo],Tabla214[[#This Row],[Nombre_desarrollo]],Tabla1012_1[Inventario_disponible],0),\"\")>0,IFERROR(_xlfn.MINIFS(Tabla1012_1[Fecha],Tabla1012_1[Nombre_desarrollo],Tabla214[[#This Row],[Nombre_desarrollo]],Tabla1012_1[Inventario_disponible],0),\"\"),\"\")","v":""},{"$f":"IF(AND(Tabla214[[#This Row],[Fecha_inicio_venta]]=\"\",Tabla214[[#This Row],[Fecha_fin_ventas]]<>\"\"),\"Se necesita fecha_inicio_venta\",IF(AND(Tabla214[[#This Row],[Fecha_inicio_venta]]=\"\",Tabla214[[#This Row],[Fecha_fin_ventas]]=\"\"),\"\",IF(AND(Tabla214[[#This Row],[Fecha_inicio_venta]]<>\"\",Tabla214[[#This Row],[Fecha_fin_ventas]]=\"\"),(YEAR(TODAY())-YEAR(Tabla214[[#This Row],[Fecha_inicio_venta]]))*12 + MONTH(TODAY())-MONTH(Tabla214[[#This Row],[Fecha_inicio_venta]]),(YEAR(Tabla214[[#This Row],[Fecha_fin_ventas]])-YEAR(Tabla214[[#This Row],[Fecha_inicio_venta]]))*12 + MONTH(Tabla214[[#This Row],[Fecha_fin_ventas]])-MONTH(Tabla214[[#This Row],[Fecha_inicio_venta]]))))","v":8},null,null,null,null,null,{"$f":"_xlfn.IFS(AND(Tabla214[[#This Row],[Fecha_inicio_construcción]]<>\"\",Tabla214[[#This Row],[Fecha_fin_construcción]]=\"\"),\"En Construcción\",AND(Tabla214[[#This Row],[Fecha_inicio_construcción]]=\"\",Tabla214[[#This Row],[Fecha_fin_construcción]]=\"\"),\"Tierra\",AND(Tabla214[[#This Row],[Fecha_inicio_construcción]]<>\"\",Tabla214[[#This Row],[Fecha_fin_construcción]]<>\"\"),\"Terminado\",AND(Tabla214[[#This Row],[Fecha_fin_construcción]]<>\"\",Tabla214[[#This Row],[Fecha_inicio_construcción]]=\"\"),\"Falta Fecha:inicio:contruccon\")","v":"Tierra"},{"$f":"IF(IFERROR(INDEX(Tabla1012_1[Inventario_disponible],MATCH(1,(Tabla1012_1[Nombre_desarrollo]=Tabla214[[#This Row],[Nombre_desarrollo]])*(Tabla1012_1[Fecha]=_xlfn.MAXIFS(Tabla1012_1[Fecha],Tabla1012_1[Nombre_desarrollo],Tabla214[[#This Row],[Nombre_desarrollo]])),0)),\"\")=0,\"Vendido\",\"Disponible\")","v":"Disponible"}]
["Amura Etapa- 4 ","Av. Atlantico Sn. Rancho Santa Monica","Sur Poniente","Grupo San Cristobal",null,"Residencial A","Block",1,1,18,1,null,{"$error":"#N/A"},"Privado","Caseta de vigilancia",{"$error":"#N/A"},{"$error":"#N/A"},{"$error":"#N/A"},{"$error":"#N/A"},null,null,null,null,null,null,null,null,null,null,{"$error":"#N/A"},{"$error":"#N/A"},{"$error":"#N/A"},{"$error":"#N/A"},{"$error":"#N/A"},"Junio 2025","Junio 2025",{"$f":"IF(IFERROR(_xlfn.MINIFS(Tabla1012_1[Fecha],Tabla1012_1[Nombre_desarrollo],Tabla214[[#This Row],[Nombre_desarrollo]],Tabla1012_1[Inventario_disponible],0),\"\")>0,IFERROR(_xlfn.MINIFS(Tabla1012_1[Fecha],Tabla1012_1[Nombre_desarrollo],Tabla214[[#This Row],[Nombre_desarrollo]],Tabla1012_1[Inventario_disponible],0),\"\"),\"\")","v":""},{"$f":"IF(AND(Tabla214[[#This Row],[Fecha_inicio_venta]]=\"\",Tabla214[[#This Row],[Fecha_fin_ventas]]<>\"\"),\"Se necesita fecha_inicio_venta\",IF(AND(Tabla214[[#This Row],[Fecha_inicio_venta]]=\"\",Tabla214[[#This Row],[Fecha_fin_ventas]]=\"\"),\"\",IF(AND(Tabla214[[#This Row],[Fecha_inicio_venta]]<>\"\",Tabla214[[#This Row],[Fecha_fin_ventas]]=\"\"),(YEAR(TODAY())-YEAR(Tabla214[[#This Row],[Fecha_inicio_venta]]))*12 + MONTH(TODAY())-MONTH(Tabla214[[#This Row],[Fecha_inicio_venta]]),(YEAR(Tabla214[[#This Row],[Fecha_fin_ventas]])-YEAR(Tabla214[[#This Row],[Fecha_inicio_venta]]))*12 + MONTH(Tabla214[[#This Row],[Fecha_fin_ventas]])-MONTH(Tabla214[[#This Row],[Fecha_inicio_venta]]))))","v":4},null,null,null,null,null,{"$f":"_xlfn.IFS(AND(Tabla214[[#This Row],[Fecha_inicio_construcción]]<>\"\",Tabla214[[#This Row],[Fecha_fin_construcción]]=\"\"),\"En Construcción\",AND(Tabla214[[#This Row],[Fecha_inicio_construcción]]=\"\",Tabla214[[#This Row],[Fecha_fin_construcción]]=\"\"),\"Tierra\",AND(Tabla214[[#This Row],[Fecha_inicio_construcción]]<>\"\",Tabla214[[#This Row],[Fecha_fin_construcción]]<>\"\"),\"Terminado\",AND(Tabla214[[#This Row],[Fecha_fin_construcción]]<>\"\",Tabla214[[#This Row],[Fecha_inicio_construcción]]=\"\"),\"Falta Fecha:inicio:contruccon\")","v":"Tierra"},{"$f":"IF(IFERROR(INDEX(Tabla1012_1[Inventario_disponible],MATCH(1,(Tabla1012_1[Nombre_desarrollo]=Tabla214[[#This Row],[Nombre_desarrollo]])*(Tabla1012_1[Fecha]=_xlfn.MAXIFS(Tabla1012_1[Fecha],Tabla1012_1[Nombre_desarrollo],Tabla214[[#This Row],[Nombre_desarrollo]])),0)),\"\")=0,\"Vendido\",\"Disponible\")","v":"Disponible"},null,{"$f":"VLOOKUP(#REF!,[1]Inf_particular_desarrollo!$A$27:$DO$1009,COLUMN([1]Inf_particular_desarrollo!$I$31),FALSE)","v":{"$error":"#REF!"}}]
["San Gerardo Residencial - Coto Lucano","Paseo San Gerardo","Sur Poniente","Terrahome",null,"Económica","Block",4,1,50,3,null,3,"Privado","Caseta de vigilancia","Caseta de vigilancia",500,"1,2,3",null,null,null,null,1,null,null,null,null,null,null,1,0,15000,"No",0,"Junio 2025","Junio 2025",{"$f":"IF(IFERROR(_xlfn.MINIFS(Tabla1012_1[Fecha],Tabla1012_1[Nombre_desarrollo],Tabla214[[#This Row],[Nombre_desarrollo]],Tabla1012_1[Inventario_disponible],0),\"\")>0,IFERROR(_xlfn.MINIFS(Tabla1012_1[Fecha],Tabla1012_1[Nombre_desarrollo],Tabla214[[#This Row],[Nombre_desarrollo]],Tabla1012_1[Inventario_disponible],0),\"\"),\"\")","v":""},{"$f":"IF(AND(Tabla214[[#This Row],[Fecha_inicio_venta]]=\"\",Tabla214[[#This Row],[Fecha_fin_ventas]]<>\"\"),\"Se necesita fecha_inicio_venta\",IF(AND(Tabla214[[#This Row],[Fecha_inicio_venta]]=\"\",Tabla214[[#This Row],[Fecha_fin_ventas]]=\"\"),\"\",IF(AND(Tabla214[[#This Row],[Fecha_inicio_venta]]<>\"\",Tabla214[[#This Row],[Fecha_fin_ventas]]=\"\"),(YEAR(TODAY())-YEAR(Tabla214[[#This Row],[Fecha_inicio_venta]]))*12 + MONTH(TODAY())-MONTH(Tabla214[[#This Row],[Fecha_inicio_venta]]),(YEAR(Tabla214[[#This Row],[Fecha_fin_ventas]])-YEAR(Tabla214[[#This Row],[Fecha_inicio_venta]]))*12 + MONTH(Tabla214[[#This Row],[Fecha_fin_ventas]])-MONTH(Tabla214[[#This Row],[Fecha_inicio_venta]]))))","v":4},null,null,null,null,null,{"$f":"_xlfn.IFS(AND(Tabla214[[#This Row],[Fecha_inicio_construcción]]<>\"\",Tabla214[[#This Row],[Fecha_fin_construcción]]=\"\"),\"En Construcción\",AND(Tabla214[[#This Row],[Fecha_inicio_construcción]]=\"\",Tabla214[[#This Row],[Fecha_fin_construcción]]=\"\"),\"Tierra\",AND(Tabla214[[#This Row],[Fecha_inicio_construcción]]<>\"\",Tabla214[[#This Row],[Fecha_fin_construcción]]<>\"\"),\"Terminado\",AND(Tabla214[[#This Row],[Fecha_fin_construcción]]<>\"\",Tabla214[[#This Row],[Fecha_inicio_construcción]]=\"\"),\"Falta Fecha:inicio:contruccon\")","v":"Tierra"},{"$f":"IF(IFERROR(INDEX(Tabla1012_1[Inventario_disponible],MATCH(1,(Tabla1012_1[Nombre_desarrollo]=Tabla214[[#This Row],[Nombre_desarrollo]])*(Tabla1012_1[Fecha]=_xlfn.MAXIFS(Tabla1012_1[Fecha],Tabla1012_1[Nombre_desarrollo],Tabla214[[#This Row],[Nombre_desarrollo]])),0)),\"\")=0,\"Vendido\",\"Disponible\")","v":"Disponible"}]
["Castelo San Francisco- Etapa 3","San Francisco de los Romo","Nor Oriente","Impulsa",null,"Media","Block",4,3,125,5,null,3,"Privado","Caseta de Vigilancia","Caseta de vigilancia",350,"1,49",null,null,null,null,2,null,null,null,null,null,null,1,0,15000,"No","No","junio 25","junio 25",{"$f":"IF(IFERROR(_xlfn.MINIFS(Tabla1012_1[Fecha],Tabla1012_1[Nombre_desarrollo],Tabla214[[#This Row],[Nombre_desarrollo]],Tabla1012_1[Inventario_disponible],0),\"\")>0,IFERROR(_xlfn.MINIFS(Tabla1012_1[Fecha],Tabla1012_1[Nombre_desarrollo],Tabla214[[#This Row],[Nombre_desarrollo]],Tabla1012_1[Inventario_disponible],0),\"\"),\"\")","v":""},{"$f":"IF(AND(Tabla214[[#This Row],[Fecha_inicio_venta]]=\"\",Tabla214[[#This Row],[Fecha_fin_ventas]]<>\"\"),\"Se necesita fecha_inicio_venta\",IF(AND(Tabla214[[#This Row],[Fecha_inicio_venta]]=\"\",Tabla214[[#This Row],[Fecha_fin_ventas]]=\"\"),\"\",IF(AND(Tabla214[[#This Row],[Fecha_inicio_venta]]<>\"\",Tabla214[[#This Row],[Fecha_fin_ventas]]=\"\"),(YEAR(TODAY())-YEAR(Tabla214[[#This Row],[Fecha_inicio_venta]]))*12 + MONTH(TODAY())-MONTH(Tabla214[[#This Row],[Fecha_inicio_venta]]),(YEAR(Tabla214[[#This Row],[Fecha_fin_ventas]])-YEAR(Tabla214[[#This Row],[Fecha_inicio_venta]]))*12 + MONTH(Tabla214[[#This Row],[Fecha_fin_ventas]])-MONTH(Tabla214[[#This Row],[Fecha_inicio_venta]]))))","v":4},null,null,null,null,null,{"$f":"_xlfn.IFS(AND(Tabla214[[#This Row],[Fecha_inicio_construcción]]<>\"\",Tabla214[[#This Row],[Fecha_fin_construcción]]=\"\"),\"En Construcción\",AND(Tabla214[[#This Row],[Fecha_inicio_construcción]]=\"\",Tabla214[[#This Row],[Fecha_fin_construcción]]=\"\"),\"Tierra\",AND(Tabla214[[#This Row],[Fecha_inicio_construcción]]<>\"\",Tabla214[[#This Row],[Fecha_fin_construcción]]<>\"\"),\"Terminado\",AND(Tabla214[[#This Row],[Fecha_fin_construcción]]<>\"\",Tabla214[[#This Row],[Fecha_inicio_construcción]]=\"\"),\"Falta Fecha:inicio:contruccon\")","v":"Tierra"},{"$f":"IF(IFERROR(INDEX(Tabla1012_1[Inventario_disponible],MATCH(1,(Tabla1012_1[Nombre_desarrollo]=Tabla214[[#This Row],[Nombre_desarrollo]])*(Tabla1012_1[Fecha]=_xlfn.MAXIFS(Tabla1012_1[Fecha],Tabla1012_1[Nombre_desarrollo],Tabla214[[#This Row],[Nombre_desarrollo]])),0)),\"\")=0,\"Vendido\",\"Disponible\")","v":"Disponible"},null,{"$f":"VLOOKUP($A28,[1]Inf_particular_desarrollo!$A$27:$DO$1009,COLUMN([1]Inf_particular_desarrollo!$I$31),FALSE)","v":"Horizontal"}]
["Paseos de los Viñedos- Lote","Paseos delas Haciendas #603, Paseos de las Haciendas Jesus Maria. Ags.",null,"Frindsa",null,0,null,1,1,16,9,null,null,"Abierto","Abierto",null,null,"",null,null,null,null,null,null,null,null,null,null,null,null,null,500,"No","No","Julio 2023","Julio 2023",{"$f":"IF(IFERROR(_xlfn.MINIFS(Tabla1012_1[Fecha],Tabla1012_1[Nombre_desarrollo],Tabla214[[#This Row],[Nombre_desarrollo]],Tabla1012_1[Inventario_disponible],0),\"\")>0,IFERROR(_xlfn.MINIFS(Tabla1012_1[Fecha],Tabla1012_1[Nombre_desarrollo],Tabla214[[#This Row],[Nombre_desarrollo]],Tabla1012_1[Inventario_disponible],0),\"\"),\"\")","v":""},{"$f":"IF(AND(Tabla214[[#This Row],[Fecha_inicio_venta]]=\"\",Tabla214[[#This Row],[Fecha_fin_ventas]]<>\"\"),\"Se necesita fecha_inicio_venta\",IF(AND(Tabla214[[#This Row],[Fecha_inicio_venta]]=\"\",Tabla214[[#This Row],[Fecha_fin_ventas]]=\"\"),\"\",IF(AND(Tabla214[[#This Row],[Fecha_inicio_venta]]<>\"\",Tabla214[[#This Row],[Fecha_fin_ventas]]=\"\"),(YEAR(TODAY())-YEAR(Tabla214[[#This Row],[Fecha_inicio_venta]]))*12 + MONTH(TODAY())-MONTH(Tabla214[[#This Row],[Fecha_inicio_venta]]),(YEAR(Tabla214[[#This Row],[Fecha_fin_ventas]])-YEAR(Tabla214[[#This Row],[Fecha_inicio_venta]]))*12 + MONTH(Tabla214[[#This Row],[Fecha_fin_ventas]])-MONTH(Tabla214[[#This Row],[Fecha_inicio_venta]]))))","v":27},null,null,null,null,null,{"$f":"_xlfn.IFS(AND(Tabla214[[#This Row],[Fecha_inicio_construcción]]<>\"\",Tabla214[[#This Row],[Fecha_fin_construcción]]=\"\"),\"En Construcción\",AND(Tabla214[[#This Row],[Fecha_inicio_construcción]]=\"\",Tabla214[[#This Row],[Fecha_fin_construcción]]=\"\"),\"Tierra\",AND(Tabla214[[#This Row],[Fecha_inicio_construcción]]<>\"\",Tabla214[[#This Row],[Fecha_fin_construcción]]<>\"\"),\"Terminado\",AND(Tabla214[[#This Row],[Fecha_fin_construcción]]<>\"\",Tabla214[[#This Row],[Fecha_inicio_construcción]]=\"\"),\"Falta Fecha:inicio:contruccon\")","v":"Tierra"},{"$f":"IF(IFERROR(INDEX(Tabla1012_1[Inventario_disponible],MATCH(1,(Tabla1012_1[Nombre_desarrollo]=Tabla214[[#This Row],[Nombre_desarrollo]])*(Tabla1012_1[Fecha]=_xlfn.MAXIFS(Tabla1012_1[Fecha],Tabla1012_1[Nombre_desarrollo],Tabla214[[#This Row],[Nombre_desarrollo]])),0)),\"\")=0,\"Vendido\",\"Disponible\")","v":"Disponible"},null,{"$f":"VLOOKUP(#REF!,[1]Inf_particular_desarrollo!$A$27:$DO$1009,COLUMN([1]Inf_particular_desarrollo!$I$31),FALSE)","v":{"$error":"#REF!"}}]
["Paseos del Bosque- Lote","Paseos de San Mateo #102 Paseos de las Providencia, San Francisco de los Romo. ",null,"Impulsa",null,0,null,1,1,7,6,null,null,"Abierto","Abierto",null,null,"",null,null,null,null,null,null,null,null,null,null,null,null,null,500,"No","No","Junio 2022","Junio 2022",{"$f":"IF(IFERROR(_xlfn.MINIFS(Tabla1012_1[Fecha],Tabla1012_1[Nombre_desarrollo],Tabla214[[#This Row],[Nombre_desarrollo]],Tabla1012_1[Inventario_disponible],0),\"\")>0,IFERROR(_xlfn.MINIFS(Tabla1012_1[Fecha],Tabla1012_1[Nombre_desarrollo],Tabla214[[#This Row],[Nombre_desarrollo]],Tabla1012_1[Inventario_disponible],0),\"\"),\"\")","v":""},{"$f":"IF(AND(Tabla214[[#This Row],[Fecha_inicio_venta]]=\"\",Tabla214[[#This Row],[Fecha_fin_ventas]]<>\"\"),\"Se necesita fecha_inicio_venta\",IF(AND(Tabla214[[#This Row],[Fecha_inicio_venta]]=\"\",Tabla214[[#This Row],[Fecha_fin_ventas]]=\"\"),\"\",IF(AND(Tabla214[[#This Row],[Fecha_inicio_venta]]<>\"\",Tabla214[[#This Row],[Fecha_fin_ventas]]=\"\"),(YEAR(TODAY())-YEAR(Tabla214[[#This Row],[Fecha_inicio_venta]]))*12 + MONTH(TODAY())-MONTH(Tabla214[[#This Row],[Fecha_inicio_venta]]),(YEAR(Tabla214[[#This Row],[Fecha_fin_ventas]])-YEAR(Tabla214[[#This Row],[Fecha_inicio_venta]]))*12 + MONTH(Tabla214[[#This Row],[Fecha_fin_ventas]])-MONTH(Tabla214[[#This Row],[Fecha_inicio_venta]]))))","v":40},null,null,null,null,null,{"$f":"_xlfn.IFS(AND(Tabla214[[#This Row],[Fecha_inicio_construcción]]<>\"\",Tabla214[[#This Row],[Fecha_fin_construcción]]=\"\"),\"En Construcción\",AND(Tabla214[[#This Row],[Fecha_inicio_construcción]]=\"\",Tabla214[[#This Row],[Fecha_fin_construcción]]=\"\"),\"Tierra\",AND(Tabla214[[#This Row],[Fecha_inicio_construcción]]<>\"\",Tabla214[[#This Row],[Fecha_fin_construcción]]<>\"\"),\"Terminado\",AND(Tabla214[[#This Row],[Fecha_fin_construcción]]<>\"\",Tabla214[[#This Row],[Fecha_inicio_construcción]]=\"\"),\"Falta Fecha:inicio:contruccon\")","v":"Tierra"},{"$f":"IF(IFERROR(INDEX(Tabla1012_1[Inventario_disponible],MATCH(1,(Tabla1012_1[Nombre_desarrollo]=Tabla214[[#This Row],[Nombre_desarrollo]])*(Tabla1012_1[Fecha]=_xlfn.MAXIFS(Tabla1012_1[Fecha],Tabla1012_1[Nombre_desarrollo],Tabla214[[#This Row],[Nombre_desarrollo]])),0)),\"\")=0,\"Vendido\",\"Disponible\")","v":"Disponible"},null,{"$f":"VLOOKUP($A29,[1]Inf_particular_desarrollo!$A$27:$DO$1009,COLUMN([1]Inf_particular_desarrollo!$I$31),FALSE)","v":"Horizontal"}]
["Torre Vertika","Trojes 105, Trojes de Alonso",null,"Terrahome",null,0,"Block",1,1,18,5,null,3,"Privado","Caseta de vigilancia","Caseta de vigilancia",2200,"4,10,11,23",0,null,null,null,1,null,null,null,null,null,null,0,15,null,0,"No","febrero 2025","febrero 2025",{"$f":"IF(IFERROR(_xlfn.MINIFS(Tabla1012_1[Fecha],Tabla1012_1[Nombre_desarrollo],Tabla214[[#This Row],[Nombre_desarrollo]],Tabla1012_1[Inventario_disponible],0),\"\")>0,IFERROR(_xlfn.MINIFS(Tabla1012_1[Fecha],Tabla1012_1[Nombre_desarrollo],Tabla214[[#This Row],[Nombre_desarrollo]],Tabla1012_1[Inventario_disponible],0),\"\"),\"\")","v":""},{"$f":"IF(AND(Tabla214[[#This Row],[Fecha_inicio_venta]]=\"\",Tabla214[[#This Row],[Fecha_fin_ventas]]<>\"\"),\"Se necesita fecha_inicio_venta\",IF(AND(Tabla214[[#This Row],[Fecha_inicio_venta]]=\"\",Tabla214[[#This Row],[Fecha_fin_ventas]]=\"\"),\"\",IF(AND(Tabla214[[#This Row],[Fecha_inicio_venta]]<>\"\",Tabla214[[#This Row],[Fecha_fin_ventas]]=\"\"),(YEAR(TODAY())-YEAR(Tabla214[[#This Row],[Fecha_inicio_venta]]))*12 + MONTH(TODAY())-MONTH(Tabla214[[#This Row],[Fecha_inicio_venta]]),(YEAR(Tabla214[[#This Row],[Fecha_fin_ventas]])-YEAR(Tabla214[[#This Row],[Fecha_inicio_venta]]))*12 + MONTH(Tabla214[[#This Row],[Fecha_fin_ventas]])-MONTH(Tabla214[[#This Row],[Fecha_inicio_venta]]))))","v":8},null,null,null,null,null,{"$f":"_xlfn.IFS(AND(Tabla214[[#This Row],[Fecha_inicio_construcción]]<>\"\",Tabla214[[#This Row],[Fecha_fin_construcción]]=\"\"),\"En Construcción\",AND(Tabla214[[#This Row],[Fecha_inicio_construcción]]=\"\",Tabla214[[#This Row],[Fecha_fin_construcción]]=\"\"),\"Tierra\",AND(Tabla214[[#This Row],[Fecha_inicio_construcción]]<>\"\",Tabla214[[#This Row],[Fecha_fin_construcción]]<>\"\"),\"Terminado\",AND(Tabla214[[#This Row],[Fecha_fin_construcción]]<>\"\",Tabla214[[#This Row],[Fecha_inicio_construcción]]=\"\"),\"Falta Fecha:inicio:contruccon\")","v":"Tierra"},{"$f":"IF(IFERROR(INDEX(Tabla1012_1[Inventario_disponible],MATCH(1,(Tabla1012_1[Nombre_desarrollo]=Tabla214[[#This Row],[Nombre_desarrollo]])*(Tabla1012_1[Fecha]=_xlfn.MAXIFS(Tabla1012_1[Fecha],Tabla1012_1[Nombre_desarrollo],Tabla214[[#This Row],[Nombre_desarrollo]])),0)),\"\")=0,\"Vendido\",\"Disponible\")","v":"Disponible"},null,{"$f":"VLOOKUP(#REF!,[1]Inf_particular_desarrollo!$A$27:$DO$1009,COLUMN([1]Inf_particular_desarrollo!$I$31),FALSE)","v":{"$error":"#REF!"}}]
["Vistas del Valle","espina amarilla s7n fracc Vistas del vslle",null,"Ricasa",null,0,"Block",5,5,140,2,null,3,"Abierto","Abierto",0,null,"",0,null,null,null,1,null,null,null,null,null,null,0,7,3000,"Si","No","Noviembre 2024","Noviembre 2024",{"$f":"IF(IFERROR(_xlfn.MINIFS(Tabla1012_1[Fecha],Tabla1012_1[Nombre_desarrollo],Tabla214[[#This Row],[Nombre_desarrollo]],Tabla1012_1[Inventario_disponible],0),\"\")>0,IFERROR(_xlfn.MINIFS(Tabla1012_1[Fecha],Tabla1012_1[Nombre_desarrollo],Tabla214[[#This Row],[Nombre_desarrollo]],Tabla1012_1[Inventario_disponible],0),\"\"),\"\")","v":""},{"$f":"IF(AND(Tabla214[[#This Row],[Fecha_inicio_venta]]=\"\",Tabla214[[#This Row],[Fecha_fin_ventas]]<>\"\"),\"Se necesita fecha_inicio_venta\",IF(AND(Tabla214[[#This Row],[Fecha_inicio_venta]]=\"\",Tabla214[[#This Row],[Fecha_fin_ventas]]=\"\"),\"\",IF(AND(Tabla214[[#This Row],[Fecha_inicio_venta]]<>\"\",Tabla214[[#This Row],[Fecha_fin_ventas]]=\"\"),(YEAR(TODAY())-YEAR(Tabla214[[#This Row],[Fecha_inicio_venta]]))*12 + MONTH(TODAY())-MONTH(Tabla214[[#This Row],[Fecha_inicio_venta]]),(YEAR(Tabla214[[#This Row],[Fecha_fin_ventas]])-YEAR(Tabla214[[#This Row],[Fecha_inicio_venta]]))*12 + MONTH(Tabla214[[#This Row],[Fecha_fin_ventas]])-MONTH(Tabla214[[#This Row],[Fecha_inicio_venta]]))))","v":11},null,null,null,null,null,{"$f":"_xlfn.IFS(AND(Tabla214[[#This Row],[Fecha_inicio_construcción]]<>\"\",Tabla214[[#This Row],[Fecha_fin_construcción]]=\"\"),\"En Construcción\",AND(Tabla214[[#This Row],[Fecha_inicio_construcción]]=\"\",Tabla214[[#This Row],[Fecha_fin_construcción]]=\"\"),\"Tierra\",AND(Tabla214[[#This Row],[Fecha_inicio_construcción]]<>\"\",Tabla214[[#This Row],[Fecha_fin_construcción]]<>\"\"),\"Terminado\",AND(Tabla214[[#This Row],[Fecha_fin_construcción]]<>\"\",Tabla214[[#This Row],[Fecha_inicio_construcción]]=\"\"),\"Falta Fecha:inicio:contruccon\")","v":"Tierra"},{"$f":"IF(IFERROR(INDEX(Tabla1012_1[Inventario_disponible],MATCH(1,(Tabla1012_1[Nombre_desarrollo]=Tabla214[[#This Row],[Nombre_desarrollo]])*(Tabla1012_1[Fecha]=_xlfn.MAXIFS(Tabla1012_1[Fecha],Tabla1012_1[Nombre_desarrollo],Tabla214[[#This Row],[Nombre_desarrollo]])),0)),\"\")=0,\"Vendido\",\"Disponible\")","v":"Disponible"},null,{"$f":"VLOOKUP(#REF!,[1]Inf_particular_desarrollo!$A$27:$DO$1009,COLUMN([1]Inf_particular_desarrollo!$I$31),FALSE)","v":{"$error":"#REF!"}}]
[null,null,null,null,null,null,null,null,null,null,null,null,null,null,null,null,null,null,null,null,null,null,null,null,null,null,null,null,null,null,null,null,null,null,null,null,null,null,null,null,null,null,null,null,null,null,{"$f":"VLOOKUP(#REF!,[1]Inf_particular_desarrollo!$A$27:$DO$1009,COLUMN([1]Inf_particular_desarrollo!$I$31),FALSE)","v":{"$error":"#REF!"}}]
[null,null,null,null,null,null,null,null,null,null,null,null,null,null,null,null,null,null,null,null,null,null,null,null,null,null,null,null,null,null,null,null,null,null,null,null,null,null,null,null,null,null,null,null,null,null,{"$f":"VLOOKUP(#REF!,[1]Inf_particular_desarrollo!$A$27:$DO$1009,COLUMN([1]Inf_particular_desarrollo!$I$31),FALSE)","v":{"$error":"#REF!"}}]
[null,null,null,null,null,null,null,null,null,null,null,null,null,null,null,null,null,null,null,null,null,null,null,null,null,null,null,null,null,null,null,null,null,null,null,null,null,null,null,null,null,null,null,null,null,null,{"$f":"VLOOKUP(#REF!,[1]Inf_particular_desarrollo!$A$27:$DO$1009,COLUMN([1]Inf_particular_desarrollo!$I$31),FALSE)","v":{"$error":"#REF!"}}]
[null,null,null,null,null,null,null,null,null,null,null,null,null,null,null,null,null,null,null,null,null,null,null,null,null,null,null,null,null,null,null,null,null,null,null,null,null,null,null,null,null,null,null,null,null,null,{"$f":"VLOOKUP(#REF!,[1]Inf_particular_desarrollo!$A$27:$DO$1009,COLUMN([1]Inf_particular_desarrollo!$I$31),FALSE)","v":{"$error":"#REF!"}}]
[null,null,null,null,null,null,null,null,null,null,null,null,null,null,null,null,null,null,null,null,null,null,null,null,null,null,null,null,null,null,null,null,null,null,null,null,null,null,null,null,null,null,null,null,null,null,{"$f":"VLOOKUP(#REF!,[1]Inf_particular_desarrollo!$A$27:$DO$1009,COLUMN([1]Inf_particular_desarrollo!$I$31),FALSE)","v":{"$error":"#REF!"}}]
[null,null,null,null,null,null,null,null,null,null,null,null,null,null,null,null,null,null,null,null,null,null,null,null,null,null,null,null,null,null,null,null,null,null,null,null,null,null,null,null,null,null,null,null,null,null,{"$f":"VLOOKUP(#REF!,[1]Inf_particular_desarrollo!$A$27:$DO$1009,COLUMN([1]Inf_particular_desarrollo!$I$31),FALSE)","v":{"$error":"#REF!"}}]
[]
[null,null,null,null,null,null,null,null,null,null,null,null,null,null,null,null,null,null,null,null,null,null,null,null,null,null,null,null,null,null,null,null,null,null,null,null,null,null,null,null,null,null,null,null,null,null,{"$f":"VLOOKUP(#REF!,[1]Inf_particular_desarrollo!$A$27:$DO$1009,COLUMN([1]Inf_particular_desarrollo!$I$31),FALSE)","v":{"$error":"#REF!"}}]
[]
[null,null,null,null,null,null,null,null,null,null,null,null,null,null,null,null,null,null,null,null,null,null,null,null,null,null,null,null,null,null,null,null,null,null,null,null,null,null,null,null,null,null,null,null,null,null,{"$f":"VLOOKUP(#REF!,[1]Inf_particular_desarrollo!$A$27:$DO$1009,COLUMN([1]Inf_particular_desarrollo!$I$31),FALSE)","v":{"$error":"#REF!"}}]
[null,null,null,null,null,null,null,null,null,null,null,null,null,null,null,null,null,null,null,null,null,null,null,null,null,null,null,null,null,null,null,null,null,null,null,null,null,null,null,null,null,null,null,null,null,null,{"$f":"VLOOKUP($A32,[1]Inf_particular_desarrollo!$A$27:$DO$1009,COLUMN([1]Inf_particular_desarrollo!$I$31),FALSE)","v":"Horizontal"}]
[]
[null,null,null,null,null,null,null,null,null,null,null,null,null,null,null,null,null,null,null,null,null,null,null,null,null,null,null,null,null,null,null,null,null,null,null,null,null,null,null,null,null,null,null,null,null,null,{"$f":"VLOOKUP($A34,[1]Inf_particular_desarrollo!$A$27:$DO$1009,COLUMN([1]Inf_particular_desarrollo!$I$31),FALSE)","v":"Horizontal"}]
[null,null,null,null,null,null,null,null,null,null,null,null,null,null,null,null,null,null,null,null,null,null,null,null,null,null,null,null,null,null,null,null,null,null,null,null,null,null,null,null,null,null,null,null,null,null,{"$f":"VLOOKUP($A35,[1]Inf_particular_desarrollo!$A$27:$DO$1009,COLUMN([1]Inf_particular_desarrollo!$I$31),FALSE)","v":"Horizontal"}]
[]
[]
[]
[]
[]
[]
[null,null,null,null,null,null,null,null,null,null,null,null,null,null,null,null,null,null,null,null,null,null,null,null,null,null,null,null,null,null,null,null,null,null,null,null,null,null,null,null,null,null,null,null,null,null,{"$f":"VLOOKUP($A42,[1]Inf_particular_desarrollo!$A$27:$DO$1009,COLUMN([1]Inf_particular_desarrollo!$I$31),FALSE)","v":"Horizontal"}]
[null,null,null,null,null,null,null,null,null,null,null,null,null,null,null,null,null,null,null,null,null,null,null,null,null,null,null,null,null,null,null,null,null,null,null,null,null,null,null,null,null,null,null,null,null,null,{"$f":"VLOOKUP(#REF!,[1]Inf_particular_desarrollo!$A$27:$DO$1009,COLUMN([1]Inf_particular_desarrollo!$I$31),FALSE)","v":{"$error":"#REF!"}}]
[null,null,null,null,null,null,null,null,null,null,null,null,null,null,null,null,null,null,null,null,null,null,null,null,null,null,null,null,null,null,null,null,null,null,null,null,null,null,null,null,null,null,null,null,null,null,{"$f":"VLOOKUP($A43,[1]Inf_particular_desarrollo!$A$27:$DO$1009,COLUMN([1]Inf_particular_desarrollo!$I$31),FALSE)","v":"Lote"}]
[null,null,null,null,null,null,null,null,null,null,null,null,null,null,null,null,null,null,null,null,null,null,null,null,null,null,null,null,null,null,null,null,null,null,null,null,null,null,null,null,null,null,null,null,null,null,{"$f":"VLOOKUP(#REF!,[1]Inf_particular_desarrollo!$A$27:$DO$1009,COLUMN([1]Inf_particular_desarrollo!$I$31),FALSE)","v":{"$error":"#REF!"}}]
[null,null,null,null,null,null,null,null,null,null,null,null,null,null,null,null,null,null,null,null,null,null,null,null,null,null,null,null,null,null,null,null,null,null,null,null,null,null,null,null,null,null,null,null,null,null,{"$f":"VLOOKUP($A44,[1]Inf_particular_desarrollo!$A$27:$DO$1009,COLUMN([1]Inf_particular_desarrollo!$I$31),FALSE)","v":"Horizontal"}]
[null,null,null,null,null,null,null,null,null,null,null,null,null,null,null,null,null,null,null,null,null,null,null,null,null,null,null,null,null,null,null,null,null,null,null,null,null,null,null,null,null,null,null,null,null,null,{"$f":"VLOOKUP($A45,[1]Inf_particular_desarrollo!$A$27:$DO$1009,COLUMN([1]Inf_particular_desarrollo!$I$31),FALSE)","v":"Horizontal"}]
[null,null,null,null,null,null,null,null,null,null,null,null,null,null,null,null,null,null,null,null,null,null,null,null,null,null,null,null,null,null,null,null,null,null,null,null,null,null,null,null,null,null,null,null,null,null,{"$f":"VLOOKUP(#REF!,[1]Inf_particular_desarrollo!$A$27:$DO$1009,COLUMN([1]Inf_particular_desarrollo!$I$31),FALSE)","v":{"$error":"#REF!"}}]
[null,null,null,null,null,null,null,null,null,null,null,null,null,null,null,null,null,null,null,null,null,null,null,null,null,null,null,null,null,null,null,null,null,null,null,null,null,null,null,null,null,null,null,null,null,null,{"$f":"VLOOKUP($A46,[1]Inf_particular_desarrollo!$A$27:$DO$1009,COLUMN([1]Inf_particular_desarrollo!$I$31),FALSE)","v":"Lote"}]
[null,null,null,null,null,null,null,null,null,null,null,null,null,null,null,null,null,null,null,null,null,null,null,null,null,null,null,null,null,null,null,null,null,null,null,null,null,null,null,null,null,null,null,null,null,null,{"$f":"VLOOKUP($A47,[1]Inf_particular_desarrollo!$A$27:$DO$1009,COLUMN([1]Inf_particular_desarrollo!$I$31),FALSE)","v":"Lote"}]
[null,null,null,null,null,null,null,null,null,null,null,null,null,null,null,null,null,null,null,null,null,null,null,null,null,null,null,null,null,null,null,null,null,null,null,null,null,null,null,null,null,null,null,null,null,null,{"$f":"VLOOKUP(#REF!,[1]Inf_particular_desarrollo!$A$27:$DO$1009,COLUMN([1]Inf_particular_desarrollo!$I$31),FALSE)","v":{"$error":"#REF!"}}]
[null,null,null,null,null,null,null,null,null,null,null,null,null,null,null,null,null,null,null,null,null,null,null,null,null,null,null,null,null,null,null,null,null,null,null,null,null,null,null,null,null,null,null,null,null,null,{"$f":"VLOOKUP(#REF!,[1]Inf_particular_desarrollo!$A$27:$DO$1009,COLUMN([1]Inf_particular_desarrollo!$I$31),FALSE)","v":{"$error":"#REF!"}}]
[null,null,null,null,null,null,null,null,null,null,null,null,null,null,null,null,null,null,null,null,null,null,null,null,null,null,null,null,null,null,null,null,null,null,null,null,null,null,null,null,null,null,null,null,null,null,{"$f":"VLOOKUP(#REF!,[1]Inf_particular_desarrollo!$A$27:$DO$1009,COLUMN([1]Inf_particular_desarrollo!$I$31),FALSE)","v":{"$error":"#REF!"}}]
[null,null,null,null,null,null,null,null,null,null,null,null,null,null,null,null,null,null,null,null,null,null,null,null,null,null,null,null,null,null,null,null,null,null,null,null,null,null,null,null,null,null,null,null,null,null,{"$f":"VLOOKUP(#REF!,[1]Inf_particular_desarrollo!$A$27:$DO$1009,COLUMN([1]Inf_particular_desarrollo!$I$31),FALSE)","v":{"$error":"#REF!"}}]
[null,null,null,null,null,null,null,null,null,null,null,null,null,null,null,null,null,null,null,null,null,null,null,null,null,null,null,null,null,null,null,null,null,null,null,null,null,null,null,null,null,null,null,null,null,null,{"$f":"VLOOKUP(#REF!,[1]Inf_particular_desarrollo!$A$27:$DO$1009,COLUMN([1]Inf_particular_desarrollo!$I$31),FALSE)","v":{"$error":"#REF!"}}]
[null,null,null,null,null,null,null,null,null,null,null,null,null,null,null,null,null,null,null,null,null,null,null,null,null,null,null,null,null,null,null,null,null,null,null,null,null,null,null,null,null,null,null,null,null,null,{"$f":"VLOOKUP(#REF!,[1]Inf_particular_desarrollo!$A$27:$DO$1009,COLUMN([1]Inf_particular_desarrollo!$I$31),FALSE)","v":{"$error":"#REF!"}}]
[null,null,null,null,null,null,null,null,null,null,null,null,null,null,null,null,null,null,null,null,null,null,null,null,null,null,null,null,null,null,null,null,null,null,null,null,null,null,null,null,null,null,null,null,null,null,{"$f":"VLOOKUP($A48,[1]Inf_particular_desarrollo!$A$27:$DO$1009,COLUMN([1]Inf_particular_desarrollo!$I$31),FALSE)","v":"Vertical"}]
[null,null,null,null,null,null,null,null,null,null,null,null,null,null,null,null,null,null,null,null,null,null,null,null,null,null,null,null,null,null,null,null,null,null,null,null,null,null,null,null,null,null,null,null,null,null,{"$f":"VLOOKUP($A49,[1]Inf_particular_desarrollo!$A$27:$DO$1009,COLUMN([1]Inf_particular_desarrollo!$I$31),FALSE)","v":"Horizontal"}]

{"sheet":"Info_Prototipos_horizontal","index":3,"n_rows":353,"n_cols":24,"rows_kept":353,"cut":false,"hidden":false,"merged":[]}
["Nombre_desarrollo","Tipo_proyecto","Nombre_prototipos","Cantitdad_unidades_prototipo","Número_recámaras","Baños_completos","Medios_baños","Número_plantas","Medida_terreno","Medida_construcción","Frente_Vivienda_(m)","Pasillo_lateral","Número_de_espacios_para_auto","Distribución","Área_para_clóset","Lavadero","Preparación_para_lavadora/secadora","Extras_en_instalación","Tipo_piso","Medida_piso","Acabados_Interiores","Acabados_exteriores","Acabado_pared","Vialidades"]
["Amura","Horizontal","Harmony",null,3,2,1,2,126,"145.47",7,"No",2,null,"Si","Si","Si","Boiler, lavadora, calentador de paso y preparación de minisplit. ",{"$f":"_xlfn.XLOOKUP(Tabla62[[#This Row],[Nombre_desarrollo]],[1]Inf_general_desarrollo!$A:$A,[1]Inf_general_desarrollo!$C:$C)","v":"Cerámico"},{"$f":"_xlfn.XLOOKUP($A2,[1]Inf_general_desarrollo!$A:$A,[1]Inf_general_desarrollo!$D:$D)","v":"60x60"},{"$f":"_xlfn.XLOOKUP($A2,[1]Inf_general_desarrollo!$A:$A,[1]Inf_general_desarrollo!$E:$E)","v":"Yeso pulido en paredes, cocina de madera y melanina, pisos de recamara y escaleras loseta tipo madera y cerámico para los demás espacios."},{"$f":"_xlfn.XLOOKUP($A2,[1]Inf_general_desarrollo!$A:$A,[1]Inf_general_desarrollo!$F:$F)","v":"Vistas en piedra cantera"},{"$f":"_xlfn.XLOOKUP($A2,[1]Inf_general_desarrollo!$A:$A,[1]Inf_general_desarrollo!$G:$G)","v":"Yeso pulido"},{"$f":"_xlfn.XLOOKUP($A2,[1]Inf_general_desarrollo!$A:$A,[1]Inf_general_desarrollo!$I:$I)","v":"Concreto Hidráulico"}]
["Amura","Horizontal","Astoria",null,3,3,1,2,126,"175.35",7,"No",2,null,"Si","Si","Si","Boiler, lavadora, calentador de paso y preparación de minisplit. ",{"$f":"_xlfn.XLOOKUP(Tabla62[[#This Row],[Nombre_desarrollo]],[1]Inf_general_desarrollo!$A:$A,[1]Inf_general_desarrollo!$C:$C)","v":"Cerámico"},{"$f":"_xlfn.XLOOKUP($A3,[1]Inf_general_desarrollo!$A:$A,[1]Inf_general_desarrollo!$D:$D)","v":"60x60"},{"$f":"_xlfn.XLOOKUP($A3,[1]Inf_general_desarrollo!$A:$A,[1]Inf_general_desarrollo!$E:$E)","v":"Yeso pulido en paredes, cocina de madera y melanina, pisos de recamara y escaleras loseta tipo madera y cerámico para los demás espacios."},{"$f":"_xlfn.XLOOKUP($A3,[1]Inf_general_desarrollo!$A:$A,[1]Inf_general_desarrollo!$F:$F)","v":"Vistas en piedra cantera"},{"$f":"_xlfn.XLOOKUP($A3,[1]Inf_general_desarrollo!$A:$A,[1]Inf_general_desarrollo!$G:$G)","v":"Yeso pulido"},{"$f":"_xlfn.XLOOKUP($A3,[1]Inf_general_desarrollo!$A:$A,[1]Inf_general_desarrollo!$I:$I)","v":"Concreto Hidráulico"}]
["Amura","Horizontal","Zafiro",null,4,4,1,2,126,"180.15",7,"No",2,null,"Si","Si","Si","Boiler, lavadora, calentador de paso y preparación de minisplit. ",{"$f":"_xlfn.XLOOKUP(Tabla62[[#This Row],[Nombre_desarrollo]],[1]Inf_general_desarrollo!$A:$A,[1]Inf_general_desarrollo!$C:$C)","v":"Cerámico"},{"$f":"_xlfn.XLOOKUP($A4,[1]Inf_general_desarrollo!$A:$A,[1]Inf_general_desarrollo!$D:$D)","v":"60x60"},{"$f":"_xlfn.XLOOKUP($A4,[1]Inf_general_desarrollo!$A:$A,[1]Inf_general_desarrollo!$E:$E)","v":"Yeso pulido en paredes, cocina de madera y melanina, pisos de recamara y escaleras loseta tipo madera y cerámico para los demás espacios."},{"$f":"_xlfn.XLOOKUP($A4,[1]Inf_general_desarrollo!$A:$A,[1]Inf_general_desarrollo!$F:$F)","v":"Vistas en piedra cantera"},{"$f":"_xlfn.XLOOKUP($A4,[1]Inf_general_desarrollo!$A:$A,[1]Inf_general_desarrollo!$G:$G)","v":"Yeso pulido"},{"$f":"_xlfn.XLOOKUP($A4,[1]Inf_general_desarrollo!$A:$A,[1]Inf_general_desarrollo!$I:$I)","v":"Concreto Hidráulico"}]
["Andrea Residencial","Horizontal","Carlo",null,3,2,1,2,119,145,8.5,"No",2,null,"Si","Si","Si","Instalación para lavadora, calentador de paso, tanque estacionario y preparación para minisplit.",{"$f":"_xlfn.XLOOKUP(Tabla62[[#This Row],[Nombre_desarrollo]],[1]Inf_general_desarrollo!$A:$A,[1]Inf_general_desarrollo!$C:$C)","v":"Cerámico"},{"$f":"_xlfn.XLOOKUP($A5,[1]Inf_general_desarrollo!$A:$A,[1]Inf_general_desarrollo!$D:$D)","v":"60x60"},{"$f":"_xlfn.XLOOKUP($A5,[1]Inf_general_desarrollo!$A:$A,[1]Inf_general_desarrollo!$E:$E)","v":"Yeso pulido en paredes, cocina de madera con acabados en granito, base de marmol con muebles de madera en baños."},{"$f":"_xlfn.XLOOKUP($A5,[1]Inf_general_desarrollo!$A:$A,[1]Inf_general_desarrollo!$F:$F)","v":"Vistas en piedra galarza y tipo madera."},{"$f":"_xlfn.XLOOKUP($A5,[1]Inf_general_desarrollo!$A:$A,[1]Inf_general_desarrollo!$G:$G)","v":"Yeso pulido"},{"$f":"_xlfn.XLOOKUP($A5,[1]Inf_general_desarrollo!$A:$A,[1]Inf_general_desarrollo!$I:$I)","v":"Concreto"}]
["Andrea Residencial","Horizontal","Dante",null,3,2,1,2,119,158.5,8.5,"No",2,null,"Si","Si","Si","Instalación para lavadora, calentador de paso, tanque estacionario y preparación para minisplit.",{"$f":"_xlfn.XLOOKUP(Tabla62[[#This Row],[Nombre_desarrollo]],[1]Inf_general_desarrollo!$A:$A,[1]Inf_general_desarrollo!$C:$C)","v":"Cerámico"},{"$f":"_xlfn.XLOOKUP($A6,[1]Inf_general_desarrollo!$A:$A,[1]Inf_general_desarrollo!$D:$D)","v":"60x60"},{"$f":"_xlfn.XLOOKUP($A6,[1]Inf_general_desarrollo!$A:$A,[1]Inf_general_desarrollo!$E:$E)","v":"Yeso pulido en paredes, cocina de madera con acabados en granito, base de marmol con muebles de madera en baños."},{"$f":"_xlfn.XLOOKUP($A6,[1]Inf_general_desarrollo!$A:$A,[1]Inf_general_desarrollo!$F:$F)","v":"Vistas en piedra galarza y tipo madera."},{"$f":"_xlfn.XLOOKUP($A6,[1]Inf_general_desarrollo!$A:$A,[1]Inf_general_desarrollo!$G:$G)","v":"Yeso pulido"},{"$f":"_xlfn.XLOOKUP($A6,[1]Inf_general_desarrollo!$A:$A,[1]Inf_general_desarrollo!$I:$I)","v":"Concreto"}]
["Andrea Residencial","Horizontal","Sabino",null,3,2,1,2,119,188,8.5,"No",2,null,"Si","Si","Si","Instalación para lavadora, calentador de paso, tanque estacionario y preparación para minisplit.",{"$f":"_xlfn.XLOOKUP(Tabla62[[#This Row],[Nombre_desarrollo]],[1]Inf_general_desarrollo!$A:$A,[1]Inf_general_desarrollo!$C:$C)","v":"Cerámico"},{"$f":"_xlfn.XLOOKUP($A7,[1]Inf_general_desarrollo!$A:$A,[1]Inf_general_desarrollo!$D:$D)","v":"60x60"},{"$f":"_xlfn.XLOOKUP($A7,[1]Inf_general_desarrollo!$A:$A,[1]Inf_general_desarrollo!$E:$E)","v":"Yeso pulido en paredes, cocina de madera con acabados en granito, base de marmol con muebles de madera en baños."},{"$f":"_xlfn.XLOOKUP($A7,[1]Inf_general_desarrollo!$A:$A,[1]Inf_general_desarrollo!$F:$F)","v":"Vistas en piedra galarza y tipo madera."},{"$f":"_xlfn.XLOOKUP($A7,[1]Inf_general_desarrollo!$A:$A,[1]Inf_general_desarrollo!$G:$G)","v":"Yeso pulido"},{"$f":"_xlfn.XLOOKUP($A7,[1]Inf_general_desarrollo!$A:$A,[1]Inf_general_desarrollo!$I:$I)","v":"Concreto"}]
["Andrea Residencial","Horizontal","Sabino Plus",null,3,2,2,2,119,235,8.5,"No",2,null,"Si","Si","Si","Instalación para lavadora, calentador de paso, tanque estacionario y preparación para minisplit.",{"$f":"_xlfn.XLOOKUP(Tabla62[[#This Row],[Nombre_desarrollo]],[1]Inf_general_desarrollo!$A:$A,[1]Inf_general_desarrollo!$C:$C)","v":"Cerámico"},{"$f":"_xlfn.XLOOKUP($A8,[1]Inf_general_desarrollo!$A:$A,[1]Inf_general_desarrollo!$D:$D)","v":"60x60"},{"$f":"_xlfn.XLOOKUP($A8,[1]Inf_general_desarrollo!$A:$A,[1]Inf_general_desarrollo!$E:$E)","v":"Yeso pulido en paredes, cocina de madera con acabados en granito, base de marmol con muebles de madera en baños."},{"$f":"_xlfn.XLOOKUP($A8,[1]Inf_general_desarrollo!$A:$A,[1]Inf_general_desarrollo!$F:$F)","v":"Vistas en piedra galarza y tipo madera."},{"$f":"_xlfn.XLOOKUP($A8,[1]Inf_general_desarrollo!$A:$A,[1]Inf_general_desarrollo!$G:$G)","v":"Yeso pulido"},{"$f":"_xlfn.XLOOKUP($A8,[1]Inf_general_desarrollo!$A:$A,[1]Inf_general_desarrollo!$I:$I)","v":"Concreto"}]
["Arroyo del Bosque","Horizontal","Bayan",null,3,3,0,2,120,"120.02",8,"No",2,null,"Si","Si","Si","Boiler e hidroneumatico.",{"$f":"_xlfn.XLOOKUP(Tabla62[[#This Row],[Nombre_desarrollo]],[1]Inf_general_desarrollo!$A:$A,[1]Inf_general_desarrollo!$C:$C)","v":"-"},{"$f":"_xlfn.XLOOKUP($A9,[1]Inf_general_desarrollo!$A:$A,[1]Inf_general_desarrollo!$D:$D)","v":"-"},{"$f":"_xlfn.XLOOKUP($A9,[1]Inf_general_desarrollo!$A:$A,[1]Inf_general_desarrollo!$E:$E)","v":"-"},{"$f":"_xlfn.XLOOKUP($A9,[1]Inf_general_desarrollo!$A:$A,[1]Inf_general_desarrollo!$F:$F)","v":"-"},{"$f":"_xlfn.XLOOKUP($A9,[1]Inf_general_desarrollo!$A:$A,[1]Inf_general_desarrollo!$G:$G)","v":"-"},{"$f":"_xlfn.XLOOKUP($A9,[1]Inf_general_desarrollo!$A:$A,[1]Inf_general_desarrollo!$I:$I)","v":"-"}]
["Bonaterra Villa Residencial","Horizontal","Tabaria",null,3,2,1,2,99,"122.55",6,"No",2,null,"Si","Si","Si","Boiler",{"$f":"_xlfn.XLOOKUP(Tabla62[[#This Row],[Nombre_desarrollo]],[1]Inf_general_desarrollo!$A:$A,[1]Inf_general_desarrollo!$C:$C)","v":"Vitropiso"},{"$f":"_xlfn.XLOOKUP($A10,[1]Inf_general_desarrollo!$A:$A,[1]Inf_general_desarrollo!$D:$D)","v":"60x60"},{"$f":"_xlfn.XLOOKUP($A10,[1]Inf_general_desarrollo!$A:$A,[1]Inf_general_desarrollo!$E:$E)","v":"Paredes en yeso pulido, ventanas con marco de aluminio negro, accesorios de baño y closet."},{"$f":"_xlfn.XLOOKUP($A10,[1]Inf_general_desarrollo!$A:$A,[1]Inf_general_desarrollo!$F:$F)","v":"Cochera con huellas de cemento, detalles en herreria y simulación madera."},{"$f":"_xlfn.XLOOKUP($A10,[1]Inf_general_desarrollo!$A:$A,[1]Inf_general_desarrollo!$G:$G)","v":"Yeso pulido"},{"$f":"_xlfn.XLOOKUP($A10,[1]Inf_general_desarrollo!$A:$A,[1]Inf_general_desarrollo!$I:$I)","v":"Concreto"}]
["Bonaterra Villa Residencial","Horizontal","Camperia",null,3,2,1,2,162,"134.94",6,"No",2,null,"Si","Si","Si","Boiler",{"$f":"_xlfn.XLOOKUP(Tabla62[[#This Row],[Nombre_desarrollo]],[1]Inf_general_desarrollo!$A:$A,[1]Inf_general_desarrollo!$C:$C)","v":"Vitropiso"},{"$f":"_xlfn.XLOOKUP($A11,[1]Inf_general_desarrollo!$A:$A,[1]Inf_general_desarrollo!$D:$D)","v":"60x60"},{"$f":"_xlfn.XLOOKUP($A11,[1]Inf_general_desarrollo!$A:$A,[1]Inf_general_desarrollo!$E:$E)","v":"Paredes en yeso pulido, ventanas con marco de aluminio negro, accesorios de baño y closet."},{"$f":"_xlfn.XLOOKUP($A11,[1]Inf_general_desarrollo!$A:$A,[1]Inf_general_desarrollo!$F:$F)","v":"Cochera con huellas de cemento, detalles en herreria y simulación madera."},{"$f":"_xlfn.XLOOKUP($A11,[1]Inf_general_desarrollo!$A:$A,[1]Inf_general_desarrollo!$G:$G)","v":"Yeso pulido"},{"$f":"_xlfn.XLOOKUP($A11,[1]Inf_general_desarrollo!$A:$A,[1]Inf_general_desarrollo!$I:$I)","v":"Concreto"}]
["Bonaterra Villa Residencial","Horizontal","Quintara",null,3,2,1,2,178,"142.37",6,"No",2,null,"Si","Si","Si","Boiler",{"$f":"_xlfn.XLOOKUP(Tabla62[[#This Row],[Nombre_desarrollo]],[1]Inf_general_desarrollo!$A:$A,[1]Inf_general_desarrollo!$C:$C)","v":"Vitropiso"},{"$f":"_xlfn.XLOOKUP($A12,[1]Inf_general_desarrollo!$A:$A,[1]Inf_general_desarrollo!$D:$D)","v":"60x60"},{"$f":"_xlfn.XLOOKUP($A12,[1]Inf_general_desarrollo!$A:$A,[1]Inf_general_desarrollo!$E:$E)","v":"Paredes en yeso pulido, ventanas con marco de aluminio negro, accesorios de baño y closet."},{"$f":"_xlfn.XLOOKUP($A12,[1]Inf_general_desarrollo!$A:$A,[1]Inf_general_desarrollo!$F:$F)","v":"Cochera con huellas de cemento, detalles en herreria y simulación madera."},{"$f":"_xlfn.XLOOKUP($A12,[1]Inf_general_desarrollo!$A:$A,[1]Inf_general_desarrollo!$G:$G)","v":"Yeso pulido"},{"$f":"_xlfn.XLOOKUP($A12,[1]Inf_general_desarrollo!$A:$A,[1]Inf_general_desarrollo!$I:$I)","v":"Concreto"}]
["Bosque Sereno","Horizontal","Monarca",null,3,2,1,2,117,"140.5","2022-05-06","No",2,null,"Si","Si","Si","Instalaciones de gas estacionario, calentador de paos, cisterna, calentador solar y preparación de minisplit.",{"$f":"_xlfn.XLOOKUP(Tabla62[[#This Row],[Nombre_desarrollo]],[1]Inf_general_desarrollo!$A:$A,[1]Inf_general_desarrollo!$C:$C)","v":"Porcelanato"},{"$f":"_xlfn.XLOOKUP($A13,[1]Inf_general_desarrollo!$A:$A,[1]Inf_general_desarrollo!$D:$D)","v":"45x90"},{"$f":"_xlfn.XLOOKUP($A13,[1]Inf_general_desarrollo!$A:$A,[1]Inf_general_desarrollo!$E:$E)","v":"baños con bases tipo mármol, cocina con acabados en granito, madera en closet,"},{"$f":"_xlfn.XLOOKUP($A13,[1]Inf_general_desarrollo!$A:$A,[1]Inf_general_desarrollo!$F:$F)","v":"Cantera"},{"$f":"_xlfn.XLOOKUP($A13,[1]Inf_general_desarrollo!$A:$A,[1]Inf_general_desarrollo!$G:$G)","v":"Texturizada"},{"$f":"_xlfn.XLOOKUP($A13,[1]Inf_general_desarrollo!$A:$A,[1]Inf_general_desarrollo!$I:$I)","v":"Concreto Hidráulico"}]
["Bosque Sereno","Horizontal","Monterreal",null,4,3,0,2,117,"142.7","2022-05-06","No",2,null,"Si","Si","Si","Instalaciones de gas estacionario, calentador de paos, cisterna, calentador solar y preparación de minisplit.",{"$f":"_xlfn.XLOOKUP(Tabla62[[#This Row],[Nombre_desarrollo]],[1]Inf_general_desarrollo!$A:$A,[1]Inf_general_desarrollo!$C:$C)","v":"Porcelanato"},{"$f":"_xlfn.XLOOKUP($A14,[1]Inf_general_desarrollo!$A:$A,[1]Inf_general_desarrollo!$D:$D)","v":"45x90"},{"$f":"_xlfn.XLOOKUP($A14,[1]Inf_general_desarrollo!$A:$A,[1]Inf_general_desarrollo!$E:$E)","v":"baños con bases tipo mármol, cocina con acabados en granito, madera en closet,"},{"$f":"_xlfn.XLOOKUP($A14,[1]Inf_general_desarrollo!$A:$A,[1]Inf_general_desarrollo!$F:$F)","v":"Cantera"},{"$f":"_xlfn.XLOOKUP($A14,[1]Inf_general_desarrollo!$A:$A,[1]Inf_general_desarrollo!$G:$G)","v":"Texturizada"},{"$f":"_xlfn.XLOOKUP($A14,[1]Inf_general_desarrollo!$A:$A,[1]Inf_general_desarrollo!$I:$I)","v":"Concreto Hidráulico"}]
["Bosque Sereno","Horizontal","Zempoala",null,3,3,0,2,117,168,"2022-05-06","No",2,null,"Si","Si","Si","Instalaciones de gas estacionario, calentador de paos, cisterna, calentador solar y preparación de minisplit.",{"$f":"_xlfn.XLOOKUP(Tabla62[[#This Row],[Nombre_desarrollo]],[1]Inf_general_desarrollo!$A:$A,[1]Inf_general_desarrollo!$C:$C)","v":"Porcelanato"},{"$f":"_xlfn.XLOOKUP($A15,[1]Inf_general_desarrollo!$A:$A,[1]Inf_general_desarrollo!$D:$D)","v":"45x90"},{"$f":"_xlfn.XLOOKUP($A15,[1]Inf_general_desarrollo!$A:$A,[1]Inf_general_desarrollo!$E:$E)","v":"baños con bases tipo mármol, cocina con acabados en granito, madera en closet,"},{"$f":"_xlfn.XLOOKUP($A15,[1]Inf_general_desarrollo!$A:$A,[1]Inf_general_desarrollo!$F:$F)","v":"Cantera"},{"$f":"_xlfn.XLOOKUP($A15,[1]Inf_general_desarrollo!$A:$A,[1]Inf_general_desarrollo!$G:$G)","v":"Texturizada"},{"$f":"_xlfn.XLOOKUP($A15,[1]Inf_general_desarrollo!$A:$A,[1]Inf_general_desarrollo!$I:$I)","v":"Concreto Hidráulico"}]
["Bosques del Paraíso","Horizontal","Nogal",null,3,2,1,2,133,"161.59",7,"No",2,null,"Si","Si","Si","Boiler y preparación solar.",{"$f":"_xlfn.XLOOKUP(Tabla62[[#This Row],[Nombre_desarrollo]],[1]Inf_general_desarrollo!$A:$A,[1]Inf_general_desarrollo!$C:$C)","v":"Cerámico"},{"$f":"_xlfn.XLOOKUP($A16,[1]Inf_general_desarrollo!$A:$A,[1]Inf_general_desarrollo!$D:$D)","v":"60x60"},{"$f":"_xlfn.XLOOKUP($A16,[1]Inf_general_desarrollo!$A:$A,[1]Inf_general_desarrollo!$E:$E)","v":"Paredes en yeso pulido, piso cerámico, escaleras con piso de adoquín, puertas de madera, espacio para closet, accesorios en baño."},{"$f":"_xlfn.XLOOKUP($A16,[1]Inf_general_desarrollo!$A:$A,[1]Inf_general_desarrollo!$F:$F)","v":"Enjarre en cochera, pasto y huellas de cemento, vista de herrería en fachada planta alta."},{"$f":"_xlfn.XLOOKUP($A16,[1]Inf_general_desarrollo!$A:$A,[1]Inf_general_desarrollo!$G:$G)","v":"Yeso pulido"},{"$f":"_xlfn.XLOOKUP($A16,[1]Inf_general_desarrollo!$A:$A,[1]Inf_general_desarrollo!$I:$I)","v":"Concreto"}]
["Bosques del Paraíso","Horizontal","Gran Paraiso",null,3,2,1,2,133,"173.34",7,"No",2,null,"Si","Si","Si","Boiler y preparación solar.",{"$f":"_xlfn.XLOOKUP(Tabla62[[#This Row],[Nombre_desarrollo]],[1]Inf_general_desarrollo!$A:$A,[1]Inf_general_desarrollo!$C:$C)","v":"Cerámico"},{"$f":"_xlfn.XLOOKUP($A17,[1]Inf_general_desarrollo!$A:$A,[1]Inf_general_desarrollo!$D:$D)","v":"60x60"},{"$f":"_xlfn.XLOOKUP($A17,[1]Inf_general_desarrollo!$A:$A,[1]Inf_general_desarrollo!$E:$E)","v":"Paredes en yeso pulido, piso cerámico, escaleras con piso de adoquín, puertas de madera, espacio para closet, accesorios en baño."},{"$f":"_xlfn.XLOOKUP($A17,[1]Inf_general_desarrollo!$A:$A,[1]Inf_general_desarrollo!$F:$F)","v":"Enjarre en cochera, pasto y huellas de cemento, vista de herrería en fachada planta alta."},{"$f":"_xlfn.XLOOKUP($A17,[1]Inf_general_desarrollo!$A:$A,[1]Inf_general_desarrollo!$G:$G)","v":"Yeso pulido"},{"$f":"_xlfn.XLOOKUP($A17,[1]Inf_general_desarrollo!$A:$A,[1]Inf_general_desarrollo!$I:$I)","v":"Concreto"}]
["Bosques del Paraíso","Horizontal","Cassia",null,3,2,1,2,"123.5","112.9","2022-05-06","No",2,null,"Si","Si","Si","Boiler y preparación solar.",{"$f":"_xlfn.XLOOKUP(Tabla62[[#This Row],[Nombre_desarrollo]],[1]Inf_general_desarrollo!$A:$A,[1]Inf_general_desarrollo!$C:$C)","v":"Cerámico"},{"$f":"_xlfn.XLOOKUP($A18,[1]Inf_general_desarrollo!$A:$A,[1]Inf_general_desarrollo!$D:$D)","v":"60x60"},{"$f":"_xlfn.XLOOKUP($A18,[1]Inf_general_desarrollo!$A:$A,[1]Inf_general_desarrollo!$E:$E)","v":"Paredes en yeso pulido, piso cerámico, escaleras con piso de adoquín, puertas de madera, espacio para closet, accesorios en baño."},{"$f":"_xlfn.XLOOKUP($A18,[1]Inf_general_desarrollo!$A:$A,[1]Inf_general_desarrollo!$F:$F)","v":"Enjarre en cochera, pasto y huellas de cemento, vista de herrería en fachada planta alta."},{"$f":"_xlfn.XLOOKUP($A18,[1]Inf_general_desarrollo!$A:$A,[1]Inf_general_desarrollo!$G:$G)","v":"Yeso pulido"},{"$f":"_xlfn.XLOOKUP($A18,[1]Inf_general_desarrollo!$A:$A,[1]Inf_general_desarrollo!$I:$I)","v":"Concreto"}]
["Bosques del Paraíso","Horizontal","Elisia",null,3,2,1,2,"123.5","116.05","2022-05-06","No",2,null,"Si","Si","Si","Boiler y preparación solar.",{"$f":"_xlfn.XLOOKUP(Tabla62[[#This Row],[Nombre_desarrollo]],[1]Inf_general_desarrollo!$A:$A,[1]Inf_general_desarrollo!$C:$C)","v":"Cerámico"},{"$f":"_xlfn.XLOOKUP($A19,[1]Inf_general_desarrollo!$A:$A,[1]Inf_general_desarrollo!$D:$D)","v":"60x60"},{"$f":"_xlfn.XLOOKUP($A19,[1]Inf_general_desarrollo!$A:$A,[1]Inf_general_desarrollo!$E:$E)","v":"Paredes en yeso pulido, piso cerámico, escaleras con piso de adoquín, puertas de madera, espacio para closet, accesorios en baño."},{"$f":"_xlfn.XLOOKUP($A19,[1]Inf_general_desarrollo!$A:$A,[1]Inf_general_desarrollo!$F:$F)","v":"Enjarre en cochera, pasto y huellas de cemento, vista de herrería en fachada planta alta."},{"$f":"_xlfn.XLOOKUP($A19,[1]Inf_general_desarrollo!$A:$A,[1]Inf_general_desarrollo!$G:$G)","v":"Yeso pulido"},{"$f":"_xlfn.XLOOKUP($A19,[1]Inf_general_desarrollo!$A:$A,[1]Inf_general_desarrollo!$I:$I)","v":"Concreto"}]
["Bosques del Paraíso","Horizontal","Dahlia",null,3,2,1,2,"123.5","125.85","2022-05-06","No",2,null,"Si","Si","Si","Boiler y preparación solar.",{"$f":"_xlfn.XLOOKUP(Tabla62[[#This Row],[Nombre_desarrollo]],[1]Inf_general_desarrollo!$A:$A,[1]Inf_general_desarrollo!$C:$C)","v":"Cerámico"},{"$f":"_xlfn.XLOOKUP($A20,[1]Inf_general_desarrollo!$A:$A,[1]Inf_general_desarrollo!$D:$D)","v":"60x60"},{"$f":"_xlfn.XLOOKUP($A20,[1]Inf_general_desarrollo!$A:$A,[1]Inf_general_desarrollo!$E:$E)","v":"Paredes en yeso pulido, piso cerámico, escaleras con piso de adoquín, puertas de madera, espacio para closet, accesorios en baño."},{"$f":"_xlfn.XLOOKUP($A20,[1]Inf_general_desarrollo!$A:$A,[1]Inf_general_desarrollo!$F:$F)","v":"Enjarre en cochera, pasto y huellas de cemento, vista de herrería en fachada planta alta."},{"$f":"_xlfn.XLOOKUP($A20,[1]Inf_general_desarrollo!$A:$A,[1]Inf_general_desarrollo!$G:$G)","v":"Yeso pulido"},{"$f":"_xlfn.XLOOKUP($A20,[1]Inf_general_desarrollo!$A:$A,[1]Inf_general_desarrollo!$I:$I)","v":"Concreto"}]
["Bosques del Paraíso- Coto Jacarandas","Horizontal","Kelia",null,2,2,0,2,"123.50","81.82","2022-05-06","No",2,null,"Si","Si","Si","Boiler y preparación solar.",{"$f":"_xlfn.XLOOKUP(Tabla62[[#This Row],[Nombre_desarrollo]],[1]Inf_general_desarrollo!$A:$A,[1]Inf_general_desarrollo!$C:$C)","v":"Cerámico"},{"$f":"_xlfn.XLOOKUP($A21,[1]Inf_general_desarrollo!$A:$A,[1]Inf_general_desarrollo!$D:$D)","v":"60x60"},{"$f":"_xlfn.XLOOKUP($A21,[1]Inf_general_desarrollo!$A:$A,[1]Inf_general_desarrollo!$E:$E)","v":"Paredes en yeso pulido, piso cerámico, escaleras con piso de adoquín, puertas de madera, espacio para closet, accesorios en baño."},{"$f":"_xlfn.XLOOKUP($A21,[1]Inf_general_desarrollo!$A:$A,[1]Inf_general_desarrollo!$F:$F)","v":"Enjarre en cochera, pasto y huellas de cemento, vista de herrería en fachada planta alta."},{"$f":"_xlfn.XLOOKUP($A21,[1]Inf_general_desarrollo!$A:$A,[1]Inf_general_desarrollo!$G:$G)","v":"Yeso pulido"},{"$f":"_xlfn.XLOOKUP($A21,[1]Inf_general_desarrollo!$A:$A,[1]Inf_general_desarrollo!$I:$I)","v":"Concreto"}]
["Bosques del Paraíso- Coto Jacarandas","Horizontal","Cassia",null,3,2,1,2,"123.5","112.9","2022-05-06","No",2,null,"Si","Si","Si","Boiler y preparación solar.",{"$f":"_xlfn.XLOOKUP(Tabla62[[#This Row],[Nombre_desarrollo]],[1]Inf_general_desarrollo!$A:$A,[1]Inf_general_desarrollo!$C:$C)","v":"Cerámico"},{"$f":"_xlfn.XLOOKUP($A22,[1]Inf_general_desarrollo!$A:$A,[1]Inf_general_desarrollo!$D:$D)","v":"60x60"},{"$f":"_xlfn.XLOOKUP($A22,[1]Inf_general_desarrollo!$A:$A,[1]Inf_general_desarrollo!$E:$E)","v":"Paredes en yeso pulido, piso cerámico, escaleras con piso de adoquín, puertas de madera, espacio para closet, accesorios en baño."},{"$f":"_xlfn.XLOOKUP($A22,[1]Inf_general_desarrollo!$A:$A,[1]Inf_general_desarrollo!$F:$F)","v":"Enjarre en cochera, pasto y huellas de cemento, vista de herrería en fachada planta alta."},{"$f":"_xlfn.XLOOKUP($A22,[1]Inf_general_desarrollo!$A:$A,[1]Inf_general_desarrollo!$G:$G)","v":"Yeso pulido"},{"$f":"_xlfn.XLOOKUP($A22,[1]Inf_general_desarrollo!$A:$A,[1]Inf_general_desarrollo!$I:$I)","v":"Concreto"}]
["Bosques del Paraíso- Coto Jacarandas","Horizontal","Elissia",null,3,2,1,2,"123.5","116.05","2022-05-06","No",2,null,"Si","Si","Si","Boiler y preparación solar.",{"$f":"_xlfn.XLOOKUP(Tabla62[[#This Row],[Nombre_desarrollo]],[1]Inf_general_desarrollo!$A:$A,[1]Inf_general_desarrollo!$C:$C)","v":"Cerámico"},{"$f":"_xlfn.XLOOKUP($A23,[1]Inf_general_desarrollo!$A:$A,[1]Inf_general_desarrollo!$D:$D)","v":"60x60"},{"$f":"_xlfn.XLOOKUP($A23,[1]Inf_general_desarrollo!$A:$A,[1]Inf_general_desarrollo!$E:$E)","v":"Paredes en yeso pulido, piso cerámico, escaleras con piso de adoquín, puertas de madera, espacio para closet, accesorios en baño."},{"$f":"_xlfn.XLOOKUP($A23,[1]Inf_general_desarrollo!$A:$A,[1]Inf_general_desarrollo!$F:$F)","v":"Enjarre en cochera, pasto y huellas de cemento, vista de herrería en fachada planta alta."},{"$f":"_xlfn.XLOOKUP($A23,[1]Inf_general_desarrollo!$A:$A,[1]Inf_general_desarrollo!$G:$G)","v":"Yeso pulido"},{"$f":"_xlfn.XLOOKUP($A23,[1]Inf_general_desarrollo!$A:$A,[1]Inf_general_desarrollo!$I:$I)","v":"Concreto"}]
["Bosques del Paraíso- Coto Jacarandas","Horizontal","Dahlia",null,3,2,1,2,"123.5","125.85","2022-05-06","No",2,null,"Si","Si","Si","Boiler y preparación solar.",{"$f":"_xlfn.XLOOKUP(Tabla62[[#This Row],[Nombre_desarrollo]],[1]Inf_general_desarrollo!$A:$A,[1]Inf_general_desarrollo!$C:$C)","v":"Cerámico"},{"$f":"_xlfn.XLOOKUP($A24,[1]Inf_general_desarrollo!$A:$A,[1]Inf_general_desarrollo!$D:$D)","v":"60x60"},{"$f":"_xlfn.XLOOKUP($A24,[1]Inf_general_desarrollo!$A:$A,[1]Inf_general_desarrollo!$E:$E)","v":"Paredes en yeso pulido, piso cerámico, escaleras con piso de adoquín, puertas de madera, espacio para closet, accesorios en baño."},{"$f":"_xlfn.XLOOKUP($A24,[1]Inf_general_desarrollo!$A:$A,[1]Inf_general_desarrollo!$F:$F)","v":"Enjarre en cochera, pasto y huellas de cemento, vista de herrería en fachada planta alta."},{"$f":"_xlfn.XLOOKUP($A24,[1]Inf_general_desarrollo!$A:$A,[1]Inf_general_desarrollo!$G:$G)","v":"Yeso pulido"},{"$f":"_xlfn.XLOOKUP($A24,[1]Inf_general_desarrollo!$A:$A,[1]Inf_general_desarrollo!$I:$I)","v":"Concreto"}]
["Cantelli","Horizontal","Adhara",null,3,3,0,2,96,"104.04",7,"No",2,null,"Si","Si","Si","Instalaciones para lavadora, gas, boiler, calentador solar, preparación para minisplit.",{"$f":"_xlfn.XLOOKUP(Tabla62[[#This Row],[Nombre_desarrollo]],[1]Inf_general_desarrollo!$A:$A,[1]Inf_general_desarrollo!$C:$C)","v":"Cerámico"},{"$f":"_xlfn.XLOOKUP($A25,[1]Inf_general_desarrollo!$A:$A,[1]Inf_general_desarrollo!$D:$D)","v":"45x65"},{"$f":"_xlfn.XLOOKUP($A25,[1]Inf_general_desarrollo!$A:$A,[1]Inf_general_desarrollo!$E:$E)","v":"Cocina con acabados en granito, paredes en yeso pulido, esquinas boleadas, accesorios de baño."},{"$f":"_xlfn.XLOOKUP($A25,[1]Inf_general_desarrollo!$A:$A,[1]Inf_general_desarrollo!$F:$F)","v":"Vistas cerámicas imitación madera, huellas de cemento en cochera."},{"$f":"_xlfn.XLOOKUP($A25,[1]Inf_general_desarrollo!$A:$A,[1]Inf_general_desarrollo!$G:$G)","v":"Yeso pulido"},{"$f":"_xlfn.XLOOKUP($A25,[1]Inf_general_desarrollo!$A:$A,[1]Inf_general_desarrollo!$I:$I)","v":"Concreto"}]
["Cantelli","Horizontal","Andromeda",null,3,2,1,2,96,"119.63",7,"No",2,null,"Si","Si","Si","Instalaciones para lavadora, gas, boiler, calentador solar, preparación para minisplit.",{"$f":"_xlfn.XLOOKUP(Tabla62[[#This Row],[Nombre_desarrollo]],[1]Inf_general_desarrollo!$A:$A,[1]Inf_general_desarrollo!$C:$C)","v":"Cerámico"},{"$f":"_xlfn.XLOOKUP($A26,[1]Inf_general_desarrollo!$A:$A,[1]Inf_general_desarrollo!$D:$D)","v":"45x65"},{"$f":"_xlfn.XLOOKUP($A26,[1]Inf_general_desarrollo!$A:$A,[1]Inf_general_desarrollo!$E:$E)","v":"Cocina con acabados en granito, paredes en yeso pulido, esquinas boleadas, accesorios de baño."},{"$f":"_xlfn.XLOOKUP($A26,[1]Inf_general_desarrollo!$A:$A,[1]Inf_general_desarrollo!$F:$F)","v":"Vistas cerámicas imitación madera, huellas de cemento en cochera."},{"$f":"_xlfn.XLOOKUP($A26,[1]Inf_general_desarrollo!$A:$A,[1]Inf_general_desarrollo!$G:$G)","v":"Yeso pulido"},{"$f":"_xlfn.XLOOKUP($A26,[1]Inf_general_desarrollo!$A:$A,[1]Inf_general_desarrollo!$I:$I)","v":"Concreto"}]
["Cantelli","Horizontal","Sirus",null,3,3,1,2,112,"123.58",7,"No",2,null,"Si","Si","Si","Instalaciones para lavadora, gas, boiler, calentador solar, preparación para minisplit.",{"$f":"_xlfn.XLOOKUP(Tabla62[[#This Row],[Nombre_desarrollo]],[1]Inf_general_desarrollo!$A:$A,[1]Inf_general_desarrollo!$C:$C)","v":"Cerámico"},{"$f":"_xlfn.XLOOKUP($A27,[1]Inf_general_desarrollo!$A:$A,[1]Inf_general_desarrollo!$D:$D)","v":"45x65"},{"$f":"_xlfn.XLOOKUP($A27,[1]Inf_general_desarrollo!$A:$A,[1]Inf_general_desarrollo!$E:$E)","v":"Cocina con acabados en granito, paredes en yeso pulido, esquinas boleadas, accesorios de baño."},{"$f":"_xlfn.XLOOKUP($A27,[1]Inf_general_desarrollo!$A:$A,[1]Inf_general_desarrollo!$F:$F)","v":"Vistas cerámicas imitación madera, huellas de cemento en cochera."},{"$f":"_xlfn.XLOOKUP($A27,[1]Inf_general_desarrollo!$A:$A,[1]Inf_general_desarrollo!$G:$G)","v":"Yeso pulido"},{"$f":"_xlfn.XLOOKUP($A27,[1]Inf_general_desarrollo!$A:$A,[1]Inf_general_desarrollo!$I:$I)","v":"Concreto"}]
["Cantelli","Horizontal","Cantelli",null,2,2,1,2,112,"118.7",7,"No",2,null,"Si","Si","Si","Instalaciones para lavadora, gas, boiler, calentador solar, preparación para minisplit.",{"$f":"_xlfn.XLOOKUP(Tabla62[[#This Row],[Nombre_desarrollo]],[1]Inf_general_desarrollo!$A:$A,[1]Inf_general_desarrollo!$C:$C)","v":"Cerámico"},{"$f":"_xlfn.XLOOKUP($A28,[1]Inf_general_desarrollo!$A:$A,[1]Inf_general_desarrollo!$D:$D)","v":"45x65"},{"$f":"_xlfn.XLOOKUP($A28,[1]Inf_general_desarrollo!$A:$A,[1]Inf_general_desarrollo!$E:$E)","v":"Cocina con acabados en granito, paredes en yeso pulido, esquinas boleadas, accesorios de baño."},{"$f":"_xlfn.XLOOKUP($A28,[1]Inf_general_desarrollo!$A:$A,[1]Inf_general_desarrollo!$F:$F)","v":"Vistas cerámicas imitación madera, huellas de cemento en cochera."},{"$f":"_xlfn.XLOOKUP($A28,[1]Inf_general_desarrollo!$A:$A,[1]Inf_general_desarrollo!$G:$G)","v":"Yeso pulido"},{"$f":"_xlfn.XLOOKUP($A28,[1]Inf_general_desarrollo!$A:$A,[1]Inf_general_desarrollo!$I:$I)","v":"Concreto"}]
["Capittala- Casas","Horizontal","Terra",null,3,3,0,2,105,106,6,"No",2,null,"Si","Si","Si","-",{"$f":"_xlfn.XLOOKUP(Tabla62[[#This Row],[Nombre_desarrollo]],[1]Inf_general_desarrollo!$A:$A,[1]Inf_general_desarrollo!$C:$C)","v":"Rectificado"},{"$f":"_xlfn.XLOOKUP($A29,[1]Inf_general_desarrollo!$A:$A,[1]Inf_general_desarrollo!$D:$D)","v":"60x60"},{"$f":"_xlfn.XLOOKUP($A29,[1]Inf_general_desarrollo!$A:$A,[1]Inf_general_desarrollo!$E:$E)","v":"Yeso pulido en paredes, acabados en pintura blanca, puertas en color blanco, revestimiento en regaderas."},{"$f":"_xlfn.XLOOKUP($A29,[1]Inf_general_desarrollo!$A:$A,[1]Inf_general_desarrollo!$F:$F)","v":"Herreria en balcones, huellas de cemento en cochera."},{"$f":"_xlfn.XLOOKUP($A29,[1]Inf_general_desarrollo!$A:$A,[1]Inf_general_desarrollo!$G:$G)","v":"Yeso pulido"},{"$f":"_xlfn.XLOOKUP($A29,[1]Inf_general_desarrollo!$A:$A,[1]Inf_general_desarrollo!$I:$I)","v":"Concreto Hidráulico"}]
["Capittala- Casas","Horizontal","Aqua",null,3,3,0,2,105,115,6,"No",2,null,"Si","Si","Si","-",{"$f":"_xlfn.XLOOKUP(Tabla62[[#This Row],[Nombre_desarrollo]],[1]Inf_general_desarrollo!$A:$A,[1]Inf_general_desarrollo!$C:$C)","v":"Rectificado"},{"$f":"_xlfn.XLOOKUP($A30,[1]Inf_general_desarrollo!$A:$A,[1]Inf_general_desarrollo!$D:$D)","v":"60x60"},{"$f":"_xlfn.XLOOKUP($A30,[1]Inf_general_desarrollo!$A:$A,[1]Inf_general_desarrollo!$E:$E)","v":"Yeso pulido en paredes, acabados en pintura blanca, puertas en color blanco, revestimiento en regaderas."},{"$f":"_xlfn.XLOOKUP($A30,[1]Inf_general_desarrollo!$A:$A,[1]Inf_general_desarrollo!$F:$F)","v":"Herreria en balcones, huellas de cemento en cochera."},{"$f":"_xlfn.XLOOKUP($A30,[1]Inf_general_desarrollo!$A:$A,[1]Inf_general_desarrollo!$G:$G)","v":"Yeso pulido"},{"$f":"_xlfn.XLOOKUP($A30,[1]Inf_general_desarrollo!$A:$A,[1]Inf_general_desarrollo!$I:$I)","v":"Concreto Hidráulico"}]
["Capittala- Casas","Horizontal","Cielum",null,3,2,1,2,105,141,6,"No",2,null,"Si","Si","Si","-",{"$f":"_xlfn.XLOOKUP(Tabla62[[#This Row],[Nombre_desarrollo]],[1]Inf_general_desarrollo!$A:$A,[1]Inf_general_desarrollo!$C:$C)","v":"Rectificado"},{"$f":"_xlfn.XLOOKUP($A31,[1]Inf_general_desarrollo!$A:$A,[1]Inf_general_desarrollo!$D:$D)","v":"60x60"},{"$f":"_xlfn.XLOOKUP($A31,[1]Inf_general_desarrollo!$A:$A,[1]Inf_general_desarrollo!$E:$E)","v":"Yeso pulido en paredes, acabados en pintura blanca, puertas en color blanco, revestimiento en regaderas."},{"$f":"_xlfn.XLOOKUP($A31,[1]Inf_general_desarrollo!$A:$A,[1]Inf_general_desarrollo!$F:$F)","v":"Herreria en balcones, huellas de cemento en cochera."},{"$f":"_xlfn.XLOOKUP($A31,[1]Inf_general_desarrollo!$A:$A,[1]Inf_general_desarrollo!$G:$G)","v":"Yeso pulido"},{"$f":"_xlfn.XLOOKUP($A31,[1]Inf_general_desarrollo!$A:$A,[1]Inf_general_desarrollo!$I:$I)","v":"Concreto Hidráulico"}]
["Capittala- Casas","Horizontal","Cielum Plus",null,3,2,1,2,105,141,6,"No",2,null,"Si","Si","Si","-",{"$f":"_xlfn.XLOOKUP(Tabla62[[#This Row],[Nombre_desarrollo]],[1]Inf_general_desarrollo!$A:$A,[1]Inf_general_desarrollo!$C:$C)","v":"Rectificado"},{"$f":"_xlfn.XLOOKUP($A32,[1]Inf_general_desarrollo!$A:$A,[1]Inf_general_desarrollo!$D:$D)","v":"60x60"},{"$f":"_xlfn.XLOOKUP($A32,[1]Inf_general_desarrollo!$A:$A,[1]Inf_general_desarrollo!$E:$E)","v":"Yeso pulido en paredes, acabados en pintura blanca, puertas en color blanco, revestimiento en regaderas."},{"$f":"_xlfn.XLOOKUP($A32,[1]Inf_general_desarrollo!$A:$A,[1]Inf_general_desarrollo!$F:$F)","v":"Herreria en balcones, huellas de cemento en cochera."},{"$f":"_xlfn.XLOOKUP($A32,[1]Inf_general_desarrollo!$A:$A,[1]Inf_general_desarrollo!$G:$G)","v":"Yeso pulido"},{"$f":"_xlfn.XLOOKUP($A32,[1]Inf_general_desarrollo!$A:$A,[1]Inf_general_desarrollo!$I:$I)","v":"Concreto Hidráulico"}]
["Capittala- Casas","Horizontal","Sol",null,3,2,0,2,105,98,6,"No",2,null,"Si","Si","Si","-",{"$f":"_xlfn.XLOOKUP(Tabla62[[#This Row],[Nombre_desarrollo]],[1]Inf_general_desarrollo!$A:$A,[1]Inf_general_desarrollo!$C:$C)","v":"Rectificado"},{"$f":"_xlfn.XLOOKUP($A33,[1]Inf_general_desarrollo!$A:$A,[1]Inf_general_desarrollo!$D:$D)","v":"60x60"},{"$f":"_xlfn.XLOOKUP($A33,[1]Inf_general_desarrollo!$A:$A,[1]Inf_general_desarrollo!$E:$E)","v":"Yeso pulido en paredes, acabados en pintura blanca, puertas en color blanco, revestimiento en regaderas."},{"$f":"_xlfn.XLOOKUP($A33,[1]Inf_general_desarrollo!$A:$A,[1]Inf_general_desarrollo!$F:$F)","v":"Herreria en balcones, huellas de cemento en cochera."},{"$f":"_xlfn.XLOOKUP($A33,[1]Inf_general_desarrollo!$A:$A,[1]Inf_general_desarrollo!$G:$G)","v":"Yeso pulido"},{"$f":"_xlfn.XLOOKUP($A33,[1]Inf_general_desarrollo!$A:$A,[1]Inf_general_desarrollo!$I:$I)","v":"Concreto Hidráulico"}]
["Capittala- Casas","Horizontal","Ignis",null,2,2,1,2,105,90,6,"No",2,null,"Si","Si","Si","-",{"$f":"_xlfn.XLOOKUP(Tabla62[[#This Row],[Nombre_desarrollo]],[1]Inf_general_desarrollo!$A:$A,[1]Inf_general_desarrollo!$C:$C)","v":"Rectificado"},{"$f":"_xlfn.XLOOKUP($A34,[1]Inf_general_desarrollo!$A:$A,[1]Inf_general_desarrollo!$D:$D)","v":"60x60"},{"$f":"_xlfn.XLOOKUP($A34,[1]Inf_general_desarrollo!$A:$A,[1]Inf_general_desarrollo!$E:$E)","v":"Yeso pulido en paredes, acabados en pintura blanca, puertas en color blanco, revestimiento en regaderas."},{"$f":"_xlfn.XLOOKUP($A34,[1]Inf_general_desarrollo!$A:$A,[1]Inf_general_desarrollo!$F:$F)","v":"Herreria en balcones, huellas de cemento en cochera."},{"$f":"_xlfn.XLOOKUP($A34,[1]Inf_general_desarrollo!$A:$A,[1]Inf_general_desarrollo!$G:$G)","v":"Yeso pulido"},{"$f":"_xlfn.XLOOKUP($A34,[1]Inf_general_desarrollo!$A:$A,[1]Inf_general_desarrollo!$I:$I)","v":"Concreto Hidráulico"}]
["Caranday Residencial","Horizontal","Toscana",null,3,2,1,2,102,"120.32",6,"No",2,null,"Si","Si","Si","Calentador solar, preparación para minisplit, boiler.",{"$f":"_xlfn.XLOOKUP(Tabla62[[#This Row],[Nombre_desarrollo]],[1]Inf_general_desarrollo!$A:$A,[1]Inf_general_desarrollo!$C:$C)","v":"Cerámico"},{"$f":"_xlfn.XLOOKUP($A35,[1]Inf_general_desarrollo!$A:$A,[1]Inf_general_desarrollo!$D:$D)","v":"60x60"},{"$f":"_xlfn.XLOOKUP($A35,[1]Inf_general_desarrollo!$A:$A,[1]Inf_general_desarrollo!$E:$E)","v":"Paredes texturizadas, mosquitero, puertas tipo madera, ovalin en baño sobre una placa de azulejo, regaderas revestidas en azulejo,"},{"$f":"_xlfn.XLOOKUP($A35,[1]Inf_general_desarrollo!$A:$A,[1]Inf_general_desarrollo!$F:$F)","v":"Concreto en cochera."},{"$f":"_xlfn.XLOOKUP($A35,[1]Inf_general_desarrollo!$A:$A,[1]Inf_general_desarrollo!$G:$G)","v":"Texturizada"},{"$f":"_xlfn.XLOOKUP($A35,[1]Inf_general_desarrollo!$A:$A,[1]Inf_general_desarrollo!$I:$I)","v":"Concreto"}]
["Caranday Residencial","Horizontal","Palermo",null,3,2,1,2,102,"109.9",6,"No",2,null,"Si","Si","Si","Calentador solar, preparación para minisplit, boiler.",{"$f":"_xlfn.XLOOKUP(Tabla62[[#This Row],[Nombre_desarrollo]],[1]Inf_general_desarrollo!$A:$A,[1]Inf_general_desarrollo!$C:$C)","v":"Cerámico"},{"$f":"_xlfn.XLOOKUP($A36,[1]Inf_general_desarrollo!$A:$A,[1]Inf_general_desarrollo!$D:$D)","v":"60x60"},{"$f":"_xlfn.XLOOKUP($A36,[1]Inf_general_desarrollo!$A:$A,[1]Inf_general_desarrollo!$E:$E)","v":"Paredes texturizadas, mosquitero, puertas tipo madera, ovalin en baño sobre una placa de azulejo, regaderas revestidas en azulejo,"},{"$f":"_xlfn.XLOOKUP($A36,[1]Inf_general_desarrollo!$A:$A,[1]Inf_general_desarrollo!$F:$F)","v":"Concreto en cochera."},{"$f":"_xlfn.XLOOKUP($A36,[1]Inf_general_desarrollo!$A:$A,[1]Inf_general_desarrollo!$G:$G)","v":"Texturizada"},{"$f":"_xlfn.XLOOKUP($A36,[1]Inf_general_desarrollo!$A:$A,[1]Inf_general_desarrollo!$I:$I)","v":"Concreto"}]
["Caranday Residencial","Horizontal","Toscana Plus",null,3,2,1,2,102,"139.46",6,"No",2,null,"Si","Si","Si","Calentador solar, preparación para minisplit, boiler.",{"$f":"_xlfn.XLOOKUP(Tabla62[[#This Row],[Nombre_desarrollo]],[1]Inf_general_desarrollo!$A:$A,[1]Inf_general_desarrollo!$C:$C)","v":"Cerámico"},{"$f":"_xlfn.XLOOKUP($A37,[1]Inf_general_desarrollo!$A:$A,[1]Inf_general_desarrollo!$D:$D)","v":"60x60"},{"$f":"_xlfn.XLOOKUP($A37,[1]Inf_general_desarrollo!$A:$A,[1]Inf_general_desarrollo!$E:$E)","v":"Paredes texturizadas, mosquitero, puertas tipo madera, ovalin en baño sobre una placa de azulejo, regaderas revestidas en azulejo,"},{"$f":"_xlfn.XLOOKUP($A37,[1]Inf_general_desarrollo!$A:$A,[1]Inf_general_desarrollo!$F:$F)","v":"Concreto en cochera."},{"$f":"_xlfn.XLOOKUP($A37,[1]Inf_general_desarrollo!$A:$A,[1]Inf_general_desarrollo!$G:$G)","v":"Texturizada"},{"$f":"_xlfn.XLOOKUP($A37,[1]Inf_general_desarrollo!$A:$A,[1]Inf_general_desarrollo!$I:$I)","v":"Concreto"}]
["Carena- Etapa 1","Horizontal","Amina",null,2,1,1,2,96,"77.4",6,"-",2,null,"-","Si","Si","-",{"$f":"_xlfn.XLOOKUP(Tabla62[[#This Row],[Nombre_desarrollo]],[1]Inf_general_desarrollo!$A:$A,[1]Inf_general_desarrollo!$C:$C)","v":"Rectificado"},{"$f":"_xlfn.XLOOKUP($A38,[1]Inf_general_desarrollo!$A:$A,[1]Inf_general_desarrollo!$D:$D)","v":"60x60"},{"$f":"_xlfn.XLOOKUP($A38,[1]Inf_general_desarrollo!$A:$A,[1]Inf_general_desarrollo!$E:$E)","v":"Barandal de herreria en escalera, yeso pulido, lavamanos sencillo, regaderas revestidas."},{"$f":"_xlfn.XLOOKUP($A38,[1]Inf_general_desarrollo!$A:$A,[1]Inf_general_desarrollo!$F:$F)","v":"Huellas de cemento en cochera, marcos de aluminio en color negro."},{"$f":"_xlfn.XLOOKUP($A38,[1]Inf_general_desarrollo!$A:$A,[1]Inf_general_desarrollo!$G:$G)","v":"Yeso pulido"},{"$f":"_xlfn.XLOOKUP($A38,[1]Inf_general_desarrollo!$A:$A,[1]Inf_general_desarrollo!$I:$I)","v":"Concreto Hidráulico"}]
["Carena- Etapa 1","Horizontal","Mara",null,2,2,1,2,96,"95.3",6,"-",2,null,"-","Si","Si","-",{"$f":"_xlfn.XLOOKUP(Tabla62[[#This Row],[Nombre_desarrollo]],[1]Inf_general_desarrollo!$A:$A,[1]Inf_general_desarrollo!$C:$C)","v":"Rectificado"},{"$f":"_xlfn.XLOOKUP($A39,[1]Inf_general_desarrollo!$A:$A,[1]Inf_general_desarrollo!$D:$D)","v":"60x60"},{"$f":"_xlfn.XLOOKUP($A39,[1]Inf_general_desarrollo!$A:$A,[1]Inf_general_desarrollo!$E:$E)","v":"Barandal de herreria en escalera, yeso pulido, lavamanos sencillo, regaderas revestidas."},{"$f":"_xlfn.XLOOKUP($A39,[1]Inf_general_desarrollo!$A:$A,[1]Inf_general_desarrollo!$F:$F)","v":"Huellas de cemento en cochera, marcos de aluminio en color negro."},{"$f":"_xlfn.XLOOKUP($A39,[1]Inf_general_desarrollo!$A:$A,[1]Inf_general_desarrollo!$G:$G)","v":"Yeso pulido"},{"$f":"_xlfn.XLOOKUP($A39,[1]Inf_general_desarrollo!$A:$A,[1]Inf_general_desarrollo!$I:$I)","v":"Concreto Hidráulico"}]
["Carena- Etapa 1","Horizontal","Alana",null,3,3,0,2,96,"100.2",6,"-",2,null,"-","Si","Si","-",{"$f":"_xlfn.XLOOKUP(Tabla62[[#This Row],[Nombre_desarrollo]],[1]Inf_general_desarrollo!$A:$A,[1]Inf_general_desarrollo!$C:$C)","v":"Rectificado"},{"$f":"_xlfn.XLOOKUP($A40,[1]Inf_general_desarrollo!$A:$A,[1]Inf_general_desarrollo!$D:$D)","v":"60x60"},{"$f":"_xlfn.XLOOKUP($A40,[1]Inf_general_desarrollo!$A:$A,[1]Inf_general_desarrollo!$E:$E)","v":"Barandal de herreria en escalera, yeso pulido, lavamanos sencillo, regaderas revestidas."},{"$f":"_xlfn.XLOOKUP($A40,[1]Inf_general_desarrollo!$A:$A,[1]Inf_general_desarrollo!$F:$F)","v":"Huellas de cemento en cochera, marcos de aluminio en color negro."},{"$f":"_xlfn.XLOOKUP($A40,[1]Inf_general_desarrollo!$A:$A,[1]Inf_general_desarrollo!$G:$G)","v":"Yeso pulido"},{"$f":"_xlfn.XLOOKUP($A40,[1]Inf_general_desarrollo!$A:$A,[1]Inf_general_desarrollo!$I:$I)","v":"Concreto Hidráulico"}]
["Carena- Etapa 1","Horizontal","Zaira",null,4,3,0,2,96,112,6,"-",2,null,"-","Si","Si","-",{"$f":"_xlfn.XLOOKUP(Tabla62[[#This Row],[Nombre_desarrollo]],[1]Inf_general_desarrollo!$A:$A,[1]Inf_general_desarrollo!$C:$C)","v":"Rectificado"},{"$f":"_xlfn.XLOOKUP($A41,[1]Inf_general_desarrollo!$A:$A,[1]Inf_general_desarrollo!$D:$D)","v":"60x60"},{"$f":"_xlfn.XLOOKUP($A41,[1]Inf_general_desarrollo!$A:$A,[1]Inf_general_desarrollo!$E:$E)","v":"Barandal de herreria en escalera, yeso pulido, lavamanos sencillo, regaderas revestidas."},{"$f":"_xlfn.XLOOKUP($A41,[1]Inf_general_desarrollo!$A:$A,[1]Inf_general_desarrollo!$F:$F)","v":"Huellas de cemento en cochera, marcos de aluminio en color negro."},{"$f":"_xlfn.XLOOKUP($A41,[1]Inf_general_desarrollo!$A:$A,[1]Inf_general_desarrollo!$G:$G)","v":"Yeso pulido"},{"$f":"_xlfn.XLOOKUP($A41,[1]Inf_general_desarrollo!$A:$A,[1]Inf_general_desarrollo!$I:$I)","v":"Concreto Hidráulico"}]
["Carena- Etapa 1","Horizontal","Everest",null,3,1,1,2,96,76,6,"-",2,null,"-","Si","Si","-",{"$f":"_xlfn.XLOOKUP(Tabla62[[#This Row],[Nombre_desarrollo]],[1]Inf_general_desarrollo!$A:$A,[1]Inf_general_desarrollo!$C:$C)","v":"Rectificado"},{"$f":"_xlfn.XLOOKUP($A42,[1]Inf_general_desarrollo!$A:$A,[1]Inf_general_desarrollo!$D:$D)","v":"60x60"},{"$f":"_xlfn.XLOOKUP($A42,[1]Inf_general_desarrollo!$A:$A,[1]Inf_general_desarrollo!$E:$E)","v":"Barandal de herreria en escalera, yeso pulido, lavamanos sencillo, regaderas revestidas."},{"$f":"_xlfn.XLOOKUP($A42,[1]Inf_general_desarrollo!$A:$A,[1]Inf_general_desarrollo!$F:$F)","v":"Huellas de cemento en cochera, marcos de aluminio en color negro."},{"$f":"_xlfn.XLOOKUP($A42,[1]Inf_general_desarrollo!$A:$A,[1]Inf_general_desarrollo!$G:$G)","v":"Yeso pulido"},{"$f":"_xlfn.XLOOKUP($A42,[1]Inf_general_desarrollo!$A:$A,[1]Inf_general_desarrollo!$I:$I)","v":"Concreto Hidráulico"}]
["Carena- Etapa 1","Horizontal","Denali",null,3,2,1,2,96,90,6,"-",2,null,"-","Si","Si","-",{"$f":"_xlfn.XLOOKUP(Tabla62[[#This Row],[Nombre_desarrollo]],[1]Inf_general_desarrollo!$A:$A,[1]Inf_general_desarrollo!$C:$C)","v":"Rectificado"},{"$f":"_xlfn.XLOOKUP($A43,[1]Inf_general_desarrollo!$A:$A,[1]Inf_general_desarrollo!$D:$D)","v":"60x60"},{"$f":"_xlfn.XLOOKUP($A43,[1]Inf_general_desarrollo!$A:$A,[1]Inf_general_desarrollo!$E:$E)","v":"Barandal de herreria en escalera, yeso pulido, lavamanos sencillo, regaderas revestidas."},{"$f":"_xlfn.XLOOKUP($A43,[1]Inf_general_desarrollo!$A:$A,[1]Inf_general_desarrollo!$F:$F)","v":"Huellas de cemento en cochera, marcos de aluminio en color negro."},{"$f":"_xlfn.XLOOKUP($A43,[1]Inf_general_desarrollo!$A:$A,[1]Inf_general_desarrollo!$G:$G)","v":"Yeso pulido"},{"$f":"_xlfn.XLOOKUP($A43,[1]Inf_general_desarrollo!$A:$A,[1]Inf_general_desarrollo!$I:$I)","v":"Concreto Hidráulico"}]
["Carena- Etapa 2","Horizontal","Amina",null,2,1,1,2,96,"77.4",6,"-",2,null,"-","Si","Si","-",{"$f":"_xlfn.XLOOKUP(Tabla62[[#This Row],[Nombre_desarrollo]],[1]Inf_general_desarrollo!$A:$A,[1]Inf_general_desarrollo!$C:$C)","v":"Rectificado"},{"$f":"_xlfn.XLOOKUP($A44,[1]Inf_general_desarrollo!$A:$A,[1]Inf_general_desarrollo!$D:$D)","v":"60x60"},{"$f":"_xlfn.XLOOKUP($A44,[1]Inf_general_desarrollo!$A:$A,[1]Inf_general_desarrollo!$E:$E)","v":"Barandal de herreria en escalera, yeso pulido, lavamanos sencillo, regaderas revestidas."},{"$f":"_xlfn.XLOOKUP($A44,[1]Inf_general_desarrollo!$A:$A,[1]Inf_general_desarrollo!$F:$F)","v":"Huellas de cemento en cochera, marcos de aluminio en color negro."},{"$f":"_xlfn.XLOOKUP($A44,[1]Inf_general_desarrollo!$A:$A,[1]Inf_general_desarrollo!$G:$G)","v":"Yeso pulido"},{"$f":"_xlfn.XLOOKUP($A44,[1]Inf_general_desarrollo!$A:$A,[1]Inf_general_desarrollo!$I:$I)","v":"Concreto Hidráulico"}]
["Carena- Etapa 2","Horizontal","Mara",null,2,2,1,2,96,"95.3",6,"-",2,null,"-","Si","Si","-",{"$f":"_xlfn.XLOOKUP(Tabla62[[#This Row],[Nombre_desarrollo]],[1]Inf_general_desarrollo!$A:$A,[1]Inf_general_desarrollo!$C:$C)","v":"Rectificado"},{"$f":"_xlfn.XLOOKUP($A45,[1]Inf_general_desarrollo!$A:$A,[1]Inf_general_desarrollo!$D:$D)","v":"60x60"},{"$f":"_xlfn.XLOOKUP($A45,[1]Inf_general_desarrollo!$A:$A,[1]Inf_general_desarrollo!$E:$E)","v":"Barandal de herreria en escalera, yeso pulido, lavamanos sencillo, regaderas revestidas."},{"$f":"_xlfn.XLOOKUP($A45,[1]Inf_general_desarrollo!$A:$A,[1]Inf_general_desarrollo!$F:$F)","v":"Huellas de cemento en cochera, marcos de aluminio en color negro."},{"$f":"_xlfn.XLOOKUP($A45,[1]Inf_general_desarrollo!$A:$A,[1]Inf_general_desarrollo!$G:$G)","v":"Yeso pulido"},{"$f":"_xlfn.XLOOKUP($A45,[1]Inf_general_desarrollo!$A:$A,[1]Inf_general_desarrollo!$I:$I)","v":"Concreto Hidráulico"}]
["Carena- Etapa 2","Horizontal","Alana",null,3,3,0,2,96,"100.2",6,"-",2,null,"-","Si","Si","-",{"$f":"_xlfn.XLOOKUP(Tabla62[[#This Row],[Nombre_desarrollo]],[1]Inf_general_desarrollo!$A:$A,[1]Inf_general_desarrollo!$C:$C)","v":"Rectificado"},{"$f":"_xlfn.XLOOKUP($A46,[1]Inf_general_desarrollo!$A:$A,[1]Inf_general_desarrollo!$D:$D)","v":"60x60"},{"$f":"_xlfn.XLOOKUP($A46,[1]Inf_general_desarrollo!$A:$A,[1]Inf_general_desarrollo!$E:$E)","v":"Barandal de herreria en escalera, yeso pulido, lavamanos sencillo, regaderas revestidas."},{"$f":"_xlfn.XLOOKUP($A46,[1]Inf_general_desarrollo!$A:$A,[1]Inf_general_desarrollo!$F:$F)","v":"Huellas de cemento en cochera, marcos de aluminio en color negro."},{"$f":"_xlfn.XLOOKUP($A46,[1]Inf_general_desarrollo!$A:$A,[1]Inf_general_desarrollo!$G:$G)","v":"Yeso pulido"},{"$f":"_xlfn.XLOOKUP($A46,[1]Inf_general_desarrollo!$A:$A,[1]Inf_general_desarrollo!$I:$I)","v":"Concreto Hidráulico"}]
["Carena- Etapa 2","Horizontal","Zaira",null,4,3,0,2,96,112,6,"-",2,null,"-","Si","Si","-",{"$f":"_xlfn.XLOOKUP(Tabla62[[#This Row],[Nombre_desarrollo]],[1]Inf_general_desarrollo!$A:$A,[1]Inf_general_desarrollo!$C:$C)","v":"Rectificado"},{"$f":"_xlfn.XLOOKUP($A47,[1]Inf_general_desarrollo!$A:$A,[1]Inf_general_desarrollo!$D:$D)","v":"60x60"},{"$f":"_xlfn.XLOOKUP($A47,[1]Inf_general_desarrollo!$A:$A,[1]Inf_general_desarrollo!$E:$E)","v":"Barandal de herreria en escalera, yeso pulido, lavamanos sencillo, regaderas revestidas."},{"$f":"_xlfn.XLOOKUP($A47,[1]Inf_general_desarrollo!$A:$A,[1]Inf_general_desarrollo!$F:$F)","v":"Huellas de cemento en cochera, marcos de aluminio en color negro."},{"$f":"_xlfn.XLOOKUP($A47,[1]Inf_general_desarrollo!$A:$A,[1]Inf_general_desarrollo!$G:$G)","v":"Yeso pulido"},{"$f":"_xlfn.XLOOKUP($A47,[1]Inf_general_desarrollo!$A:$A,[1]Inf_general_desarrollo!$I:$I)","v":"Concreto Hidráulico"}]
["Carena- Etapa 2","Horizontal","Everest",null,3,1,1,2,96,76,6,"-",2,null,"-","Si","Si","-",{"$f":"_xlfn.XLOOKUP(Tabla62[[#This Row],[Nombre_desarrollo]],[1]Inf_general_desarrollo!$A:$A,[1]Inf_general_desarrollo!$C:$C)","v":"Rectificado"},{"$f":"_xlfn.XLOOKUP($A48,[1]Inf_general_desarrollo!$A:$A,[1]Inf_general_desarrollo!$D:$D)","v":"60x60"},{"$f":"_xlfn.XLOOKUP($A48,[1]Inf_general_desarrollo!$A:$A,[1]Inf_general_desarrollo!$E:$E)","v":"Barandal de herreria en escalera, yeso pulido, lavamanos sencillo, regaderas revestidas."},{"$f":"_xlfn.XLOOKUP($A48,[1]Inf_general_desarrollo!$A:$A,[1]Inf_general_desarrollo!$F:$F)","v":"Huellas de cemento en cochera, marcos de aluminio en color negro."},{"$f":"_xlfn.XLOOKUP($A48,[1]Inf_general_desarrollo!$A:$A,[1]Inf_general_desarrollo!$G:$G)","v":"Yeso pulido"},{"$f":"_xlfn.XLOOKUP($A48,[1]Inf_general_desarrollo!$A:$A,[1]Inf_general_desarrollo!$I:$I)","v":"Concreto Hidráulico"}]
["Carena- Etapa 2","Horizontal","Denali",null,3,2,1,2,96,90,6,"-",2,null,"-","Si","Si","-",{"$f":"_xlfn.XLOOKUP(Tabla62[[#This Row],[Nombre_desarrollo]],[1]Inf_general_desarrollo!$A:$A,[1]Inf_general_desarrollo!$C:$C)","v":"Rectificado"},{"$f":"_xlfn.XLOOKUP($A49,[1]Inf_general_desarrollo!$A:$A,[1]Inf_general_desarrollo!$D:$D)","v":"60x60"},{"$f":"_xlfn.XLOOKUP($A49,[1]Inf_general_desarrollo!$A:$A,[1]Inf_general_desarrollo!$E:$E)","v":"Barandal de herreria en escalera, yeso pulido, lavamanos sencillo, regaderas revestidas."},{"$f":"_xlfn.XLOOKUP($A49,[1]Inf_general_desarrollo!$A:$A,[1]Inf_general_desarrollo!$F:$F)","v":"Huellas de cemento en cochera, marcos de aluminio en color negro."},{"$f":"_xlfn.XLOOKUP($A49,[1]Inf_general_desarrollo!$A:$A,[1]Inf_general_desarrollo!$G:$G)","v":"Yeso pulido"},{"$f":"_xlfn.XLOOKUP($A49,[1]Inf_general_desarrollo!$A:$A,[1]Inf_general_desarrollo!$I:$I)","v":"Concreto Hidráulico"}]
["Castelo San Francisco","Horizontal","Bardi Plus",null,3,2,1,1,111,66,6,"No",2,null,"Si","Si","Si","Lavadora, secadora, gas, calentdor solar, minisplit, antenas de tv.",{"$f":"_xlfn.XLOOKUP(Tabla62[[#This Row],[Nombre_desarrollo]],[1]Inf_general_desarrollo!$A:$A,[1]Inf_general_desarrollo!$C:$C)","v":"Cerámico"},{"$f":"_xlfn.XLOOKUP($A50,[1]Inf_general_desarrollo!$A:$A,[1]Inf_general_desarrollo!$D:$D)","v":"60x60"},{"$f":"_xlfn.XLOOKUP($A50,[1]Inf_general_desarrollo!$A:$A,[1]Inf_general_desarrollo!$E:$E)","v":"Yeso pulido, acabados en granito en barras de cocina, baños revestidos."},{"$f":"_xlfn.XLOOKUP($A50,[1]Inf_general_desarrollo!$A:$A,[1]Inf_general_desarrollo!$F:$F)","v":"Yeso pulido, fachaleta tipo madera y acedor en modelo moncalieri."},{"$f":"_xlfn.XLOOKUP($A50,[1]Inf_general_desarrollo!$A:$A,[1]Inf_general_desarrollo!$G:$G)","v":"Yeso pulido"},{"$f":"_xlfn.XLOOKUP($A50,[1]Inf_general_desarrollo!$A:$A,[1]Inf_general_desarrollo!$I:$I)","v":"Concreto Hidráulico"}]
["Castelo San Francisco","Horizontal","Miramare",null,3,2,1,2,111,115,6,"No",2,null,"Si","Si","Si","Lavadora, secadora, gas, calentdor solar, minisplit, antenas de tv.",{"$f":"_xlfn.XLOOKUP(Tabla62[[#This Row],[Nombre_desarrollo]],[1]Inf_general_desarrollo!$A:$A,[1]Inf_general_desarrollo!$C:$C)","v":"Cerámico"},{"$f":"_xlfn.XLOOKUP($A51,[1]Inf_general_desarrollo!$A:$A,[1]Inf_general_desarrollo!$D:$D)","v":"60x60"},{"$f":"_xlfn.XLOOKUP($A51,[1]Inf_general_desarrollo!$A:$A,[1]Inf_general_desarrollo!$E:$E)","v":"Yeso pulido, acabados en granito en barras de cocina, baños revestidos."},{"$f":"_xlfn.XLOOKUP($A51,[1]Inf_general_desarrollo!$A:$A,[1]Inf_general_desarrollo!$F:$F)","v":"Yeso pulido, fachaleta tipo madera y acedor en modelo moncalieri."},{"$f":"_xlfn.XLOOKUP($A51,[1]Inf_general_desarrollo!$A:$A,[1]Inf_general_desarrollo!$G:$G)","v":"Yeso pulido"},{"$f":"_xlfn.XLOOKUP($A51,[1]Inf_general_desarrollo!$A:$A,[1]Inf_general_desarrollo!$I:$I)","v":"Concreto Hidráulico"}]
["Castelo San Francisco","Horizontal","Montecalieri",null,3,2,1,2,111,140,6,"No",2,null,"Si","Si","Si","Lavadora, secadora, gas, calentdor solar, minisplit, antenas de tv.",{"$f":"_xlfn.XLOOKUP(Tabla62[[#This Row],[Nombre_desarrollo]],[1]Inf_general_desarrollo!$A:$A,[1]Inf_general_desarrollo!$C:$C)","v":"Cerámico"},{"$f":"_xlfn.XLOOKUP($A52,[1]Inf_general_desarrollo!$A:$A,[1]Inf_general_desarrollo!$D:$D)","v":"60x60"},{"$f":"_xlfn.XLOOKUP($A52,[1]Inf_general_desarrollo!$A:$A,[1]Inf_general_desarrollo!$E:$E)","v":"Yeso pulido, acabados en granito en barras de cocina, baños revestidos."},{"$f":"_xlfn.XLOOKUP($A52,[1]Inf_general_desarrollo!$A:$A,[1]Inf_general_desarrollo!$F:$F)","v":"Yeso pulido, fachaleta tipo madera y acedor en modelo moncalieri."},{"$f":"_xlfn.XLOOKUP($A52,[1]Inf_general_desarrollo!$A:$A,[1]Inf_general_desarrollo!$G:$G)","v":"Yeso pulido"},{"$f":"_xlfn.XLOOKUP($A52,[1]Inf_general_desarrollo!$A:$A,[1]Inf_general_desarrollo!$I:$I)","v":"Concreto Hidráulico"}]
["Castelo San Francisco","Horizontal","Balasi",null,4,3,1,2,111,130,6,"No",2,null,"Si","Si","Si","Lavadora, secadora, gas, calentdor solar, minisplit, antenas de tv.",{"$f":"_xlfn.XLOOKUP(Tabla62[[#This Row],[Nombre_desarrollo]],[1]Inf_general_desarrollo!$A:$A,[1]Inf_general_desarrollo!$C:$C)","v":"Cerámico"},{"$f":"_xlfn.XLOOKUP($A53,[1]Inf_general_desarrollo!$A:$A,[1]Inf_general_desarrollo!$D:$D)","v":"60x60"},{"$f":"_xlfn.XLOOKUP($A53,[1]Inf_general_desarrollo!$A:$A,[1]Inf_general_desarrollo!$E:$E)","v":"Yeso pulido, acabados en granito en barras de cocina, baños revestidos."},{"$f":"_xlfn.XLOOKUP($A53,[1]Inf_general_desarrollo!$A:$A,[1]Inf_general_desarrollo!$F:$F)","v":"Yeso pulido, fachaleta tipo madera y acedor en modelo moncalieri."},{"$f":"_xlfn.XLOOKUP($A53,[1]Inf_general_desarrollo!$A:$A,[1]Inf_general_desarrollo!$G:$G)","v":"Yeso pulido"},{"$f":"_xlfn.XLOOKUP($A53,[1]Inf_general_desarrollo!$A:$A,[1]Inf_general_desarrollo!$I:$I)","v":"Concreto Hidráulico"}]
["Castelo San Francisco- Etapa 2","Horizontal","Bardi Plus",null,3,2,1,1,111,66,6,"No",2,null,"Si","Si","Si","Lavadora, secadora, gas, calentdor solar, minisplit, antenas de tv.",{"$f":"_xlfn.XLOOKUP(Tabla62[[#This Row],[Nombre_desarrollo]],[1]Inf_general_desarrollo!$A:$A,[1]Inf_general_desarrollo!$C:$C)","v":"Cerámico"},{"$f":"_xlfn.XLOOKUP($A54,[1]Inf_general_desarrollo!$A:$A,[1]Inf_general_desarrollo!$D:$D)","v":"60x60"},{"$f":"_xlfn.XLOOKUP($A54,[1]Inf_general_desarrollo!$A:$A,[1]Inf_general_desarrollo!$E:$E)","v":"Yeso pulido, acabados en granito en barras de cocina, baños revestidos."},{"$f":"_xlfn.XLOOKUP($A54,[1]Inf_general_desarrollo!$A:$A,[1]Inf_general_desarrollo!$F:$F)","v":"Yeso pulido, fachaleta tipo madera y acedor en modelo moncalieri."},{"$f":"_xlfn.XLOOKUP($A54,[1]Inf_general_desarrollo!$A:$A,[1]Inf_general_desarrollo!$G:$G)","v":"Yeso pulido"},{"$f":"_xlfn.XLOOKUP($A54,[1]Inf_general_desarrollo!$A:$A,[1]Inf_general_desarrollo!$I:$I)","v":"Concreto Hidráulico"}]
["Castelo San Francisco- Etapa 2","Horizontal","Miramare",null,3,2,1,2,111,115,6,"No",2,null,"Si","Si","Si","Lavadora, secadora, gas, calentdor solar, minisplit, antenas de tv.",{"$f":"_xlfn.XLOOKUP(Tabla62[[#This Row],[Nombre_desarrollo]],[1]Inf_general_desarrollo!$A:$A,[1]Inf_general_desarrollo!$C:$C)","v":"Cerámico"},{"$f":"_xlfn.XLOOKUP($A55,[1]Inf_general_desarrollo!$A:$A,[1]Inf_general_desarrollo!$D:$D)","v":"60x60"},{"$f":"_xlfn.XLOOKUP($A55,[1]Inf_general_desarrollo!$A:$A,[1]Inf_general_desarrollo!$E:$E)","v":"Yeso pulido, acabados en granito en barras de cocina, baños revestidos."},{"$f":"_xlfn.XLOOKUP($A55,[1]Inf_general_desarrollo!$A:$A,[1]Inf_general_desarrollo!$F:$F)","v":"Yeso pulido, fachaleta tipo madera y acedor en modelo moncalieri."},{"$f":"_xlfn.XLOOKUP($A55,[1]Inf_general_desarrollo!$A:$A,[1]Inf_general_desarrollo!$G:$G)","v":"Yeso pulido"},{"$f":"_xlfn.XLOOKUP($A55,[1]Inf_general_desarrollo!$A:$A,[1]Inf_general_desarrollo!$I:$I)","v":"Concreto Hidráulico"}]
["Castelo San Francisco- Etapa 2","Horizontal","Montecalieri",null,3,2,1,2,111,140,6,"No",2,null,"Si","Si","Si","Lavadora, secadora, gas, calentdor solar, minisplit, antenas de tv.",{"$f":"_xlfn.XLOOKUP(Tabla62[[#This Row],[Nombre_desarrollo]],[1]Inf_general_desarrollo!$A:$A,[1]Inf_general_desarrollo!$C:$C)","v":"Cerámico"},{"$f":"_xlfn.XLOOKUP($A56,[1]Inf_general_desarrollo!$A:$A,[1]Inf_general_desarrollo!$D:$D)","v":"60x60"},{"$f":"_xlfn.XLOOKUP($A56,[1]Inf_general_desarrollo!$A:$A,[1]Inf_general_desarrollo!$E:$E)","v":"Yeso pulido, acabados en granito en barras de cocina, baños revestidos."},{"$f":"_xlfn.XLOOKUP($A56,[1]Inf_general_desarrollo!$A:$A,[1]Inf_general_desarrollo!$F:$F)","v":"Yeso pulido, fachaleta tipo madera y acedor en modelo moncalieri."},{"$f":"_xlfn.XLOOKUP($A56,[1]Inf_general_desarrollo!$A:$A,[1]Inf_general_desarrollo!$G:$G)","v":"Yeso pulido"},{"$f":"_xlfn.XLOOKUP($A56,[1]Inf_general_desarrollo!$A:$A,[1]Inf_general_desarrollo!$I:$I)","v":"Concreto Hidráulico"}]
["Castelo San Francisco- Etapa 2","Horizontal","Balasi",null,4,3,1,2,111,130,6,"No",2,null,"Si","Si","Si","Lavadora, secadora, gas, calentdor solar, minisplit, antenas de tv.",{"$f":"_xlfn.XLOOKUP(Tabla62[[#This Row],[Nombre_desarrollo]],[1]Inf_general_desarrollo!$A:$A,[1]Inf_general_desarrollo!$C:$C)","v":"Cerámico"},{"$f":"_xlfn.XLOOKUP($A57,[1]Inf_general_desarrollo!$A:$A,[1]Inf_general_desarrollo!$D:$D)","v":"60x60"},{"$f":"_xlfn.XLOOKUP($A57,[1]Inf_general_desarrollo!$A:$A,[1]Inf_general_desarrollo!$E:$E)","v":"Yeso pulido, acabados en granito en barras de cocina, baños revestidos."},{"$f":"_xlfn.XLOOKUP($A57,[1]Inf_general_desarrollo!$A:$A,[1]Inf_general_desarrollo!$F:$F)","v":"Yeso pulido, fachaleta tipo madera y acedor en modelo moncalieri."},{"$f":"_xlfn.XLOOKUP($A57,[1]Inf_general_desarrollo!$A:$A,[1]Inf_general_desarrollo!$G:$G)","v":"Yeso pulido"},{"$f":"_xlfn.XLOOKUP($A57,[1]Inf_general_desarrollo!$A:$A,[1]Inf_general_desarrollo!$I:$I)","v":"Concreto Hidráulico"}]
["Catania Spazio","Horizontal","Zafiro",null,3,3,0,2,"144.33",142,7,"No",2,null,"Si","Si","Si","Instalación para gas natural, lavadora, calentador de paso y minisplit.",{"$f":"_xlfn.XLOOKUP(Tabla62[[#This Row],[Nombre_desarrollo]],[1]Inf_general_desarrollo!$A:$A,[1]Inf_general_desarrollo!$C:$C)","v":"Cerámico"},{"$f":"_xlfn.XLOOKUP($A58,[1]Inf_general_desarrollo!$A:$A,[1]Inf_general_desarrollo!$D:$D)","v":"60x60"},{"$f":"_xlfn.XLOOKUP($A58,[1]Inf_general_desarrollo!$A:$A,[1]Inf_general_desarrollo!$E:$E)","v":"Yeso pulido, pisos cerámicos, acabados de granito en cocina, cancel de herrería en escalera."},{"$f":"_xlfn.XLOOKUP($A58,[1]Inf_general_desarrollo!$A:$A,[1]Inf_general_desarrollo!$F:$F)","v":"Ventanas con marco de aluminio color blanco, herrería en balcones, revestimiento en fachada."},{"$f":"_xlfn.XLOOKUP($A58,[1]Inf_general_desarrollo!$A:$A,[1]Inf_general_desarrollo!$G:$G)","v":"Yeso pulido"},{"$f":"_xlfn.XLOOKUP($A58,[1]Inf_general_desarrollo!$A:$A,[1]Inf_general_desarrollo!$I:$I)","v":"Concreto Hidráulico"}]
["Catania Spazio","Horizontal","Diamante",null,3,2,1,2,"136.84",138,7,"No",2,null,"Si","Si","Si","Instalación para gas natural, lavadora, calentador de paso y minisplit.",{"$f":"_xlfn.XLOOKUP(Tabla62[[#This Row],[Nombre_desarrollo]],[1]Inf_general_desarrollo!$A:$A,[1]Inf_general_desarrollo!$C:$C)","v":"Cerámico"},{"$f":"_xlfn.XLOOKUP($A59,[1]Inf_general_desarrollo!$A:$A,[1]Inf_general_desarrollo!$D:$D)","v":"60x60"},{"$f":"_xlfn.XLOOKUP($A59,[1]Inf_general_desarrollo!$A:$A,[1]Inf_general_desarrollo!$E:$E)","v":"Yeso pulido, pisos cerámicos, acabados de granito en cocina, cancel de herrería en escalera."},{"$f":"_xlfn.XLOOKUP($A59,[1]Inf_general_desarrollo!$A:$A,[1]Inf_general_desarrollo!$F:$F)","v":"Ventanas con marco de aluminio color blanco, herrería en balcones, revestimiento en fachada."},{"$f":"_xlfn.XLOOKUP($A59,[1]Inf_general_desarrollo!$A:$A,[1]Inf_general_desarrollo!$G:$G)","v":"Yeso pulido"},{"$f":"_xlfn.XLOOKUP($A59,[1]Inf_general_desarrollo!$A:$A,[1]Inf_general_desarrollo!$I:$I)","v":"Concreto Hidráulico"}]
["Coto Hacienda Verde","Horizontal","Sauce",null,3,2,1,2,90,104,6,"No",2,null,"Si","Si","Si","Boiler.",{"$f":"_xlfn.XLOOKUP(Tabla62[[#This Row],[Nombre_desarrollo]],[1]Inf_general_desarrollo!$A:$A,[1]Inf_general_desarrollo!$C:$C)","v":"Vitropiso"},{"$f":"_xlfn.XLOOKUP($A60,[1]Inf_general_desarrollo!$A:$A,[1]Inf_general_desarrollo!$D:$D)","v":"50x50"},{"$f":"_xlfn.XLOOKUP($A60,[1]Inf_general_desarrollo!$A:$A,[1]Inf_general_desarrollo!$E:$E)","v":"Accesorios de baño, paredes en yeso pulido."},{"$f":"_xlfn.XLOOKUP($A60,[1]Inf_general_desarrollo!$A:$A,[1]Inf_general_desarrollo!$F:$F)","v":"Huellas de cemento en cochera, muros lisos y acabados tipo piedra."},{"$f":"_xlfn.XLOOKUP($A60,[1]Inf_general_desarrollo!$A:$A,[1]Inf_general_desarrollo!$G:$G)","v":"Yeso pulido"},{"$f":"_xlfn.XLOOKUP($A60,[1]Inf_general_desarrollo!$A:$A,[1]Inf_general_desarrollo!$I:$I)","v":"Concreto"}]
["Encino Verde","Horizontal","Altamira",null,3,3,0,2,114,182,6,null,null,null,null,null,null,null,{"$f":"_xlfn.XLOOKUP(Tabla62[[#This Row],[Nombre_desarrollo]],[1]Inf_general_desarrollo!$A:$A,[1]Inf_general_desarrollo!$C:$C)","v":0},{"$f":"_xlfn.XLOOKUP($A61,[1]Inf_general_desarrollo!$A:$A,[1]Inf_general_desarrollo!$D:$D)","v":0},{"$f":"_xlfn.XLOOKUP($A61,[1]Inf_general_desarrollo!$A:$A,[1]Inf_general_desarrollo!$E:$E)","v":0},{"$f":"_xlfn.XLOOKUP($A61,[1]Inf_general_desarrollo!$A:$A,[1]Inf_general_desarrollo!$F:$F)","v":0},{"$f":"_xlfn.XLOOKUP($A61,[1]Inf_general_desarrollo!$A:$A,[1]Inf_general_desarrollo!$G:$G)","v":0},{"$f":"_xlfn.XLOOKUP($A61,[1]Inf_general_desarrollo!$A:$A,[1]Inf_general_desarrollo!$I:$I)","v":0}]
["Hacienda el Cobano -Roble Castaño","Horizontal","Sierra Fría",null,3,2,1,2,114,135,6,"No",2,null,"Si","Si","Si","Boiler, lavadora, minisplit, secadora.",{"$f":"_xlfn.XLOOKUP(Tabla62[[#This Row],[Nombre_desarrollo]],[1]Inf_general_desarrollo!$A:$A,[1]Inf_general_desarrollo!$C:$C)","v":"Cerámico"},{"$f":"_xlfn.XLOOKUP($A62,[1]Inf_general_desarrollo!$A:$A,[1]Inf_general_desarrollo!$D:$D)","v":"60x60"},{"$f":"_xlfn.XLOOKUP($A62,[1]Inf_general_desarrollo!$A:$A,[1]Inf_general_desarrollo!$E:$E)","v":"Yeso pulido, acabados en granito en cocina, mármol en lavabos, barandal de cristal en escaleras."},{"$f":"_xlfn.XLOOKUP($A62,[1]Inf_general_desarrollo!$A:$A,[1]Inf_general_desarrollo!$F:$F)","v":"Yeso pulido, vistas de fachaleta tipo madera de piedra."},{"$f":"_xlfn.XLOOKUP($A62,[1]Inf_general_desarrollo!$A:$A,[1]Inf_general_desarrollo!$G:$G)","v":"Yeso pulido"},{"$f":"_xlfn.XLOOKUP($A62,[1]Inf_general_desarrollo!$A:$A,[1]Inf_general_desarrollo!$I:$I)","v":"Concreto"}]
["Hacienda el Cobano -Roble Castaño","Horizontal","Aveiro",null,3,2,1,2,114,162,7,"No",2,null,"Si","Si","Si","Boiler, lavadora, minisplit, secadora.",{"$f":"_xlfn.XLOOKUP(Tabla62[[#This Row],[Nombre_desarrollo]],[1]Inf_general_desarrollo!$A:$A,[1]Inf_general_desarrollo!$C:$C)","v":"Cerámico"},{"$f":"_xlfn.XLOOKUP($A63,[1]Inf_general_desarrollo!$A:$A,[1]Inf_general_desarrollo!$D:$D)","v":"60x60"},{"$f":"_xlfn.XLOOKUP($A63,[1]Inf_general_desarrollo!$A:$A,[1]Inf_general_desarrollo!$E:$E)","v":"Yeso pulido, acabados en granito en cocina, mármol en lavabos, barandal de cristal en escaleras."},{"$f":"_xlfn.XLOOKUP($A63,[1]Inf_general_desarrollo!$A:$A,[1]Inf_general_desarrollo!$F:$F)","v":"Yeso pulido, vistas de fachaleta tipo madera de piedra."},{"$f":"_xlfn.XLOOKUP($A63,[1]Inf_general_desarrollo!$A:$A,[1]Inf_general_desarrollo!$G:$G)","v":"Yeso pulido"},{"$f":"_xlfn.XLOOKUP($A63,[1]Inf_general_desarrollo!$A:$A,[1]Inf_general_desarrollo!$I:$I)","v":"Concreto"}]
["Hacienda el Cobano -Roble Castaño","Horizontal","Altamira",null,3,3,0,2,114,182,7,"Si",2,null,"Si","Si","Si","Boiler, lavadora, minisplit, secadora.",{"$f":"_xlfn.XLOOKUP(Tabla62[[#This Row],[Nombre_desarrollo]],[1]Inf_general_desarrollo!$A:$A,[1]Inf_general_desarrollo!$C:$C)","v":"Cerámico"},{"$f":"_xlfn.XLOOKUP($A64,[1]Inf_general_desarrollo!$A:$A,[1]Inf_general_desarrollo!$D:$D)","v":"60x60"},{"$f":"_xlfn.XLOOKUP($A64,[1]Inf_general_desarrollo!$A:$A,[1]Inf_general_desarrollo!$E:$E)","v":"Yeso pulido, acabados en granito en cocina, mármol en lavabos, barandal de cristal en escaleras."},{"$f":"_xlfn.XLOOKUP($A64,[1]Inf_general_desarrollo!$A:$A,[1]Inf_general_desarrollo!$F:$F)","v":"Yeso pulido, vistas de fachaleta tipo madera de piedra."},{"$f":"_xlfn.XLOOKUP($A64,[1]Inf_general_desarrollo!$A:$A,[1]Inf_general_desarrollo!$G:$G)","v":"Yeso pulido"},{"$f":"_xlfn.XLOOKUP($A64,[1]Inf_general_desarrollo!$A:$A,[1]Inf_general_desarrollo!$I:$I)","v":"Concreto"}]
["La Cartuja Residencial","Horizontal","Rioja",null,2,2,1,2,99,"96.68",6,"No",2,null,"Si","Si","Si","Instalaciones para lavadora, calentador de paso.",{"$f":"_xlfn.XLOOKUP(Tabla62[[#This Row],[Nombre_desarrollo]],[1]Inf_general_desarrollo!$A:$A,[1]Inf_general_desarrollo!$C:$C)","v":"Cerámico"},{"$f":"_xlfn.XLOOKUP($A65,[1]Inf_general_desarrollo!$A:$A,[1]Inf_general_desarrollo!$D:$D)","v":"60x60"},{"$f":"_xlfn.XLOOKUP($A65,[1]Inf_general_desarrollo!$A:$A,[1]Inf_general_desarrollo!$E:$E)","v":"Yeso pulido en paredes, cocina de madera, melamina, pisos en recamaras y escalera, loseta tipo madera."},{"$f":"_xlfn.XLOOKUP($A65,[1]Inf_general_desarrollo!$A:$A,[1]Inf_general_desarrollo!$F:$F)","v":"Vista en piedra o loseta tipo madera."},{"$f":"_xlfn.XLOOKUP($A65,[1]Inf_general_desarrollo!$A:$A,[1]Inf_general_desarrollo!$G:$G)","v":"Yeso pulido"},{"$f":"_xlfn.XLOOKUP($A65,[1]Inf_general_desarrollo!$A:$A,[1]Inf_general_desarrollo!$I:$I)","v":"Concreto"}]
["La Cartuja Residencial","Horizontal","Segovia",null,3,3,0,2,99,"102.66",6,"No",2,null,"Si","Si","Si","Instalaciones para lavadora, calentador de paso.",{"$f":"_xlfn.XLOOKUP(Tabla62[[#This Row],[Nombre_desarrollo]],[1]Inf_general_desarrollo!$A:$A,[1]Inf_general_desarrollo!$C:$C)","v":"Cerámico"},{"$f":"_xlfn.XLOOKUP($A66,[1]Inf_general_desarrollo!$A:$A,[1]Inf_general_desarrollo!$D:$D)","v":"60x60"},{"$f":"_xlfn.XLOOKUP($A66,[1]Inf_general_desarrollo!$A:$A,[1]Inf_general_desarrollo!$E:$E)","v":"Yeso pulido en paredes, cocina de madera, melamina, pisos en recamaras y escalera, loseta tipo madera."},{"$f":"_xlfn.XLOOKUP($A66,[1]Inf_general_desarrollo!$A:$A,[1]Inf_general_desarrollo!$F:$F)","v":"Vista en piedra o loseta tipo madera."},{"$f":"_xlfn.XLOOKUP($A66,[1]Inf_general_desarrollo!$A:$A,[1]Inf_general_desarrollo!$G:$G)","v":"Yeso pulido"},{"$f":"_xlfn.XLOOKUP($A66,[1]Inf_general_desarrollo!$A:$A,[1]Inf_general_desarrollo!$I:$I)","v":"Concreto"}]
["La Cartuja Residencial","Horizontal","Castilla",null,3,3,0,2,99,"112.6",6,"No",2,null,"Si","Si","Si","Instalaciones para lavadora, calentador de paso.",{"$f":"_xlfn.XLOOKUP(Tabla62[[#This Row],[Nombre_desarrollo]],[1]Inf_general_desarrollo!$A:$A,[1]Inf_general_desarrollo!$C:$C)","v":"Cerámico"},{"$f":"_xlfn.XLOOKUP($A67,[1]Inf_general_desarrollo!$A:$A,[1]Inf_general_desarrollo!$D:$D)","v":"60x60"},{"$f":"_xlfn.XLOOKUP($A67,[1]Inf_general_desarrollo!$A:$A,[1]Inf_general_desarrollo!$E:$E)","v":"Yeso pulido en paredes, cocina de madera, melamina, pisos en recamaras y escalera, loseta tipo madera."},{"$f":"_xlfn.XLOOKUP($A67,[1]Inf_general_desarrollo!$A:$A,[1]Inf_general_desarrollo!$F:$F)","v":"Vista en piedra o loseta tipo madera."},{"$f":"_xlfn.XLOOKUP($A67,[1]Inf_general_desarrollo!$A:$A,[1]Inf_general_desarrollo!$G:$G)","v":"Yeso pulido"},{"$f":"_xlfn.XLOOKUP($A67,[1]Inf_general_desarrollo!$A:$A,[1]Inf_general_desarrollo!$I:$I)","v":"Concreto"}]
["La Cartuja Residencial","Horizontal","Palma",null,3,3,0,2,99,"122.7",6,"No",2,null,"Si","Si","Si","Instalaciones para lavadora, calentador de paso.",{"$f":"_xlfn.XLOOKUP(Tabla62[[#This Row],[Nombre_desarrollo]],[1]Inf_general_desarrollo!$A:$A,[1]Inf_general_desarrollo!$C:$C)","v":"Cerámico"},{"$f":"_xlfn.XLOOKUP($A68,[1]Inf_general_desarrollo!$A:$A,[1]Inf_general_desarrollo!$D:$D)","v":"60x60"},{"$f":"_xlfn.XLOOKUP($A68,[1]Inf_general_desarrollo!$A:$A,[1]Inf_general_desarrollo!$E:$E)","v":"Yeso pulido en paredes, cocina de madera, melamina, pisos en recamaras y escalera, loseta tipo madera."},{"$f":"_xlfn.XLOOKUP($A68,[1]Inf_general_desarrollo!$A:$A,[1]Inf_general_desarrollo!$F:$F)","v":"Vista en piedra o loseta tipo madera."},{"$f":"_xlfn.XLOOKUP($A68,[1]Inf_general_desarrollo!$A:$A,[1]Inf_general_desarrollo!$G:$G)","v":"Yeso pulido"},{"$f":"_xlfn.XLOOKUP($A68,[1]Inf_general_desarrollo!$A:$A,[1]Inf_general_desarrollo!$I:$I)","v":"Concreto"}]
["La Perla Norte","Horizontal","Celta",null,3,3,0,2,135,220,"2022-05-07","No",2,null,"Si","Si","Si","Instalación para lavadora, secadora, minisplit.",{"$f":"_xlfn.XLOOKUP(Tabla62[[#This Row],[Nombre_desarrollo]],[1]Inf_general_desarrollo!$A:$A,[1]Inf_general_desarrollo!$C:$C)","v":"Cerámico"},{"$f":"_xlfn.XLOOKUP($A69,[1]Inf_general_desarrollo!$A:$A,[1]Inf_general_desarrollo!$D:$D)","v":"60x60"},{"$f":"_xlfn.XLOOKUP($A69,[1]Inf_general_desarrollo!$A:$A,[1]Inf_general_desarrollo!$E:$E)","v":"Yeso pulido, mármol, granito, paneles cerámicos de relieve."},{"$f":"_xlfn.XLOOKUP($A69,[1]Inf_general_desarrollo!$A:$A,[1]Inf_general_desarrollo!$F:$F)","v":"Yeso pulido y cantera."},{"$f":"_xlfn.XLOOKUP($A69,[1]Inf_general_desarrollo!$A:$A,[1]Inf_general_desarrollo!$G:$G)","v":"Yeso pulido"},{"$f":"_xlfn.XLOOKUP($A69,[1]Inf_general_desarrollo!$A:$A,[1]Inf_general_desarrollo!$I:$I)","v":"Concreto Hidráulico"}]
["La Perla Norte","Horizontal","Frisia",null,3,3,0,2,135,215,"2022-05-07","No",2,null,"Si","Si","Si","Instalación para lavadora, secadora, minisplit.",{"$f":"_xlfn.XLOOKUP(Tabla62[[#This Row],[Nombre_desarrollo]],[1]Inf_general_desarrollo!$A:$A,[1]Inf_general_desarrollo!$C:$C)","v":"Cerámico"},{"$f":"_xlfn.XLOOKUP($A70,[1]Inf_general_desarrollo!$A:$A,[1]Inf_general_desarrollo!$D:$D)","v":"60x60"},{"$f":"_xlfn.XLOOKUP($A70,[1]Inf_general_desarrollo!$A:$A,[1]Inf_general_desarrollo!$E:$E)","v":"Yeso pulido, mármol, granito, paneles cerámicos de relieve."},{"$f":"_xlfn.XLOOKUP($A70,[1]Inf_general_desarrollo!$A:$A,[1]Inf_general_desarrollo!$F:$F)","v":"Yeso pulido y cantera."},{"$f":"_xlfn.XLOOKUP($A70,[1]Inf_general_desarrollo!$A:$A,[1]Inf_general_desarrollo!$G:$G)","v":"Yeso pulido"},{"$f":"_xlfn.XLOOKUP($A70,[1]Inf_general_desarrollo!$A:$A,[1]Inf_general_desarrollo!$I:$I)","v":"Concreto Hidráulico"}]
["La Perla Norte","Horizontal","Sobek",null,3,3,0,2,135,195,"2022-05-07","No",2,null,"Si","Si","Si","Instalación para lavadora, secadora, minisplit.",{"$f":"_xlfn.XLOOKUP(Tabla62[[#This Row],[Nombre_desarrollo]],[1]Inf_general_desarrollo!$A:$A,[1]Inf_general_desarrollo!$C:$C)","v":"Cerámico"},{"$f":"_xlfn.XLOOKUP($A71,[1]Inf_general_desarrollo!$A:$A,[1]Inf_general_desarrollo!$D:$D)","v":"60x60"},{"$f":"_xlfn.XLOOKUP($A71,[1]Inf_general_desarrollo!$A:$A,[1]Inf_general_desarrollo!$E:$E)","v":"Yeso pulido, mármol, granito, paneles cerámicos de relieve."},{"$f":"_xlfn.XLOOKUP($A71,[1]Inf_general_desarrollo!$A:$A,[1]Inf_general_desarrollo!$F:$F)","v":"Yeso pulido y cantera."},{"$f":"_xlfn.XLOOKUP($A71,[1]Inf_general_desarrollo!$A:$A,[1]Inf_general_desarrollo!$G:$G)","v":"Yeso pulido"},{"$f":"_xlfn.XLOOKUP($A71,[1]Inf_general_desarrollo!$A:$A,[1]Inf_general_desarrollo!$I:$I)","v":"Concreto Hidráulico"}]
["La Perla Norte","Horizontal","Mallorca",null,4,3,1,2,135,"248.5","2022-05-07","No",2,null,"Si","Si","Si","Instalación para lavadora, secadora, minisplit.",{"$f":"_xlfn.XLOOKUP(Tabla62[[#This Row],[Nombre_desarrollo]],[1]Inf_general_desarrollo!$A:$A,[1]Inf_general_desarrollo!$C:$C)","v":"Cerámico"},{"$f":"_xlfn.XLOOKUP($A72,[1]Inf_general_desarrollo!$A:$A,[1]Inf_general_desarrollo!$D:$D)","v":"60x60"},{"$f":"_xlfn.XLOOKUP($A72,[1]Inf_general_desarrollo!$A:$A,[1]Inf_general_desarrollo!$E:$E)","v":"Yeso pulido, mármol, granito, paneles cerámicos de relieve."},{"$f":"_xlfn.XLOOKUP($A72,[1]Inf_general_desarrollo!$A:$A,[1]Inf_general_desarrollo!$F:$F)","v":"Yeso pulido y cantera."},{"$f":"_xlfn.XLOOKUP($A72,[1]Inf_general_desarrollo!$A:$A,[1]Inf_general_desarrollo!$G:$G)","v":"Yeso pulido"},{"$f":"_xlfn.XLOOKUP($A72,[1]Inf_general_desarrollo!$A:$A,[1]Inf_general_desarrollo!$I:$I)","v":"Concreto Hidráulico"}]
["La Perla Norte","Horizontal","Akoya",null,4,3,1,2,135,173,"2022-05-07","No",2,null,"Si","Si","Si","Instalación para lavadora, secadora, minisplit.",{"$f":"_xlfn.XLOOKUP(Tabla62[[#This Row],[Nombre_desarrollo]],[1]Inf_general_desarrollo!$A:$A,[1]Inf_general_desarrollo!$C:$C)","v":"Cerámico"},{"$f":"_xlfn.XLOOKUP($A73,[1]Inf_general_desarrollo!$A:$A,[1]Inf_general_desarrollo!$D:$D)","v":"60x60"},{"$f":"_xlfn.XLOOKUP($A73,[1]Inf_general_desarrollo!$A:$A,[1]Inf_general_desarrollo!$E:$E)","v":"Yeso pulido, mármol, granito, paneles cerámicos de relieve."},{"$f":"_xlfn.XLOOKUP($A73,[1]Inf_general_desarrollo!$A:$A,[1]Inf_general_desarrollo!$F:$F)","v":"Yeso pulido y cantera."},{"$f":"_xlfn.XLOOKUP($A73,[1]Inf_general_desarrollo!$A:$A,[1]Inf_general_desarrollo!$G:$G)","v":"Yeso pulido"},{"$f":"_xlfn.XLOOKUP($A73,[1]Inf_general_desarrollo!$A:$A,[1]Inf_general_desarrollo!$I:$I)","v":"Concreto Hidráulico"}]
["Lombardía Condominio","Horizontal","Brescia",null,3,2,1,2,90,101,6,"No",2,null,"Si","Si","Si","Calentador de agua, gas, cisterna, preparación minisplit, lavadora y secadora.",{"$f":"_xlfn.XLOOKUP(Tabla62[[#This Row],[Nombre_desarrollo]],[1]Inf_general_desarrollo!$A:$A,[1]Inf_general_desarrollo!$C:$C)","v":"Cerámico"},{"$f":"_xlfn.XLOOKUP($A74,[1]Inf_general_desarrollo!$A:$A,[1]Inf_general_desarrollo!$D:$D)","v":"60x60"},{"$f":"_xlfn.XLOOKUP($A74,[1]Inf_general_desarrollo!$A:$A,[1]Inf_general_desarrollo!$E:$E)","v":"Yeso pulido, acabados en fachaleta, pisos ceramicos, cocina con melamina."},{"$f":"_xlfn.XLOOKUP($A74,[1]Inf_general_desarrollo!$A:$A,[1]Inf_general_desarrollo!$F:$F)","v":"Fachaleta tipo madera"},{"$f":"_xlfn.XLOOKUP($A74,[1]Inf_general_desarrollo!$A:$A,[1]Inf_general_desarrollo!$G:$G)","v":"Yeso pulido"},{"$f":"_xlfn.XLOOKUP($A74,[1]Inf_general_desarrollo!$A:$A,[1]Inf_general_desarrollo!$I:$I)","v":"Concreto Hidráulico"}]
["Lombardía Condominio","Horizontal","Verona",null,3,2,1,2,90,125,6,"No",2,null,"Si","Si","Si","Calentador de agua, gas, cisterna, preparación minisplit, lavadora y secadora.",{"$f":"_xlfn.XLOOKUP(Tabla62[[#This Row],[Nombre_desarrollo]],[1]Inf_general_desarrollo!$A:$A,[1]Inf_general_desarrollo!$C:$C)","v":"Cerámico"},{"$f":"_xlfn.XLOOKUP($A75,[1]Inf_general_desarrollo!$A:$A,[1]Inf_general_desarrollo!$D:$D)","v":"60x60"},{"$f":"_xlfn.XLOOKUP($A75,[1]Inf_general_desarrollo!$A:$A,[1]Inf_general_desarrollo!$E:$E)","v":"Yeso pulido, acabados en fachaleta, pisos ceramicos, cocina con melamina."},{"$f":"_xlfn.XLOOKUP($A75,[1]Inf_general_desarrollo!$A:$A,[1]Inf_general_desarrollo!$F:$F)","v":"Fachaleta tipo madera"},{"$f":"_xlfn.XLOOKUP($A75,[1]Inf_general_desarrollo!$A:$A,[1]Inf_general_desarrollo!$G:$G)","v":"Yeso pulido"},{"$f":"_xlfn.XLOOKUP($A75,[1]Inf_general_desarrollo!$A:$A,[1]Inf_general_desarrollo!$I:$I)","v":"Concreto Hidráulico"}]
["Lucerna Residencial","Horizontal","Danubio",null,3,2,1,2,105,"135.58",6,"No",2,null,"Si","Si","Si","Instalaciones de gas, lavadora y boiler.",{"$f":"_xlfn.XLOOKUP(Tabla62[[#This Row],[Nombre_desarrollo]],[1]Inf_general_desarrollo!$A:$A,[1]Inf_general_desarrollo!$C:$C)","v":"Cerámico"},{"$f":"_xlfn.XLOOKUP($A76,[1]Inf_general_desarrollo!$A:$A,[1]Inf_general_desarrollo!$D:$D)","v":"60x60"},{"$f":"_xlfn.XLOOKUP($A76,[1]Inf_general_desarrollo!$A:$A,[1]Inf_general_desarrollo!$E:$E)","v":"Texturizado en paredes, closet de madera, accesorios de baño sencillos."},{"$f":"_xlfn.XLOOKUP($A76,[1]Inf_general_desarrollo!$A:$A,[1]Inf_general_desarrollo!$F:$F)","v":"Yeso pulido en exterior y vistas en piedra galarza"},{"$f":"_xlfn.XLOOKUP($A76,[1]Inf_general_desarrollo!$A:$A,[1]Inf_general_desarrollo!$G:$G)","v":"Texturizada"},{"$f":"_xlfn.XLOOKUP($A76,[1]Inf_general_desarrollo!$A:$A,[1]Inf_general_desarrollo!$I:$I)","v":"Concreto"}]
["Lucerna Residencial","Horizontal","Niza",null,3,2,1,2,105,"112.04",6,"No",2,null,"Si","Si","Si","Instalaciones de gas, lavadora y boiler.",{"$f":"_xlfn.XLOOKUP(Tabla62[[#This Row],[Nombre_desarrollo]],[1]Inf_general_desarrollo!$A:$A,[1]Inf_general_desarrollo!$C:$C)","v":"Cerámico"},{"$f":"_xlfn.XLOOKUP($A77,[1]Inf_general_desarrollo!$A:$A,[1]Inf_general_desarrollo!$D:$D)","v":"60x60"},{"$f":"_xlfn.XLOOKUP($A77,[1]Inf_general_desarrollo!$A:$A,[1]Inf_general_desarrollo!$E:$E)","v":"Texturizado en paredes, closet de madera, accesorios de baño sencillos."},{"$f":"_xlfn.XLOOKUP($A77,[1]Inf_general_desarrollo!$A:$A,[1]Inf_general_desarrollo!$F:$F)","v":"Yeso pulido en exterior y vistas en piedra galarza"},{"$f":"_xlfn.XLOOKUP($A77,[1]Inf_general_desarrollo!$A:$A,[1]Inf_general_desarrollo!$G:$G)","v":"Texturizada"},{"$f":"_xlfn.XLOOKUP($A77,[1]Inf_general_desarrollo!$A:$A,[1]Inf_general_desarrollo!$I:$I)","v":"Concreto"}]
["Lucerna Residencial","Horizontal","Zurich",null,3,2,1,2,105,"118.6",6,"No",2,null,"Si","Si","Si","Instalaciones de gas, lavadora y boiler.",{"$f":"_xlfn.XLOOKUP(Tabla62[[#This Row],[Nombre_desarrollo]],[1]Inf_general_desarrollo!$A:$A,[1]Inf_general_desarrollo!$C:$C)","v":"Cerámico"},{"$f":"_xlfn.XLOOKUP($A78,[1]Inf_general_desarrollo!$A:$A,[1]Inf_general_desarrollo!$D:$D)","v":"60x60"},{"$f":"_xlfn.XLOOKUP($A78,[1]Inf_general_desarrollo!$A:$A,[1]Inf_general_desarrollo!$E:$E)","v":"Texturizado en paredes, closet de madera, accesorios de baño sencillos."},{"$f":"_xlfn.XLOOKUP($A78,[1]Inf_general_desarrollo!$A:$A,[1]Inf_general_desarrollo!$F:$F)","v":"Yeso pulido en exterior y vistas en piedra galarza"},{"$f":"_xlfn.XLOOKUP($A78,[1]Inf_general_desarrollo!$A:$A,[1]Inf_general_desarrollo!$G:$G)","v":"Texturizada"},{"$f":"_xlfn.XLOOKUP($A78,[1]Inf_general_desarrollo!$A:$A,[1]Inf_general_desarrollo!$I:$I)","v":"Concreto"}]
["Lucerna Residencial","Horizontal","Ginebra",null,3,2,1,2,105,"122.58",6,"No",2,null,"Si","Si","Si","Instalaciones de gas, lavadora y boiler.",{"$f":"_xlfn.XLOOKUP(Tabla62[[#This Row],[Nombre_desarrollo]],[1]Inf_general_desarrollo!$A:$A,[1]Inf_general_desarrollo!$C:$C)","v":"Cerámico"},{"$f":"_xlfn.XLOOKUP($A79,[1]Inf_general_desarrollo!$A:$A,[1]Inf_general_desarrollo!$D:$D)","v":"60x60"},{"$f":"_xlfn.XLOOKUP($A79,[1]Inf_general_desarrollo!$A:$A,[1]Inf_general_desarrollo!$E:$E)","v":"Texturizado en paredes, closet de madera, accesorios de baño sencillos."},{"$f":"_xlfn.XLOOKUP($A79,[1]Inf_general_desarrollo!$A:$A,[1]Inf_general_desarrollo!$F:$F)","v":"Yeso pulido en exterior y vistas en piedra galarza"},{"$f":"_xlfn.XLOOKUP($A79,[1]Inf_general_desarrollo!$A:$A,[1]Inf_general_desarrollo!$G:$G)","v":"Texturizada"},{"$f":"_xlfn.XLOOKUP($A79,[1]Inf_general_desarrollo!$A:$A,[1]Inf_general_desarrollo!$I:$I)","v":"Concreto"}]
["Mangata Residencial","Horizontal","Nahir",null,3,3,0,2,102,86,6,"No",2,null,"Si","Si","Si","Instalaciones para gas y minisplit.",{"$f":"_xlfn.XLOOKUP(Tabla62[[#This Row],[Nombre_desarrollo]],[1]Inf_general_desarrollo!$A:$A,[1]Inf_general_desarrollo!$C:$C)","v":"Cerámico"},{"$f":"_xlfn.XLOOKUP($A80,[1]Inf_general_desarrollo!$A:$A,[1]Inf_general_desarrollo!$D:$D)","v":"45x75"},{"$f":"_xlfn.XLOOKUP($A80,[1]Inf_general_desarrollo!$A:$A,[1]Inf_general_desarrollo!$E:$E)","v":"Paredes texturizadas, pisos cerámicos, baños con placa en mármol con regaderas revestidas, espacio para closet."},{"$f":"_xlfn.XLOOKUP($A80,[1]Inf_general_desarrollo!$A:$A,[1]Inf_general_desarrollo!$F:$F)","v":"Huellas de cemento en cochera, vistas cerámicas tipo madera, ventanas con marco de aluminio."},{"$f":"_xlfn.XLOOKUP($A80,[1]Inf_general_desarrollo!$A:$A,[1]Inf_general_desarrollo!$G:$G)","v":"Yeso pulido"},{"$f":"_xlfn.XLOOKUP($A80,[1]Inf_general_desarrollo!$A:$A,[1]Inf_general_desarrollo!$I:$I)","v":"Concreto"}]
["Mangata Residencial","Horizontal","Lua",null,3,2,1,2,102,110,6,"No",2,null,"Si","Si","Si","Instalaciones para gas y minisplit.",{"$f":"_xlfn.XLOOKUP(Tabla62[[#This Row],[Nombre_desarrollo]],[1]Inf_general_desarrollo!$A:$A,[1]Inf_general_desarrollo!$C:$C)","v":"Cerámico"},{"$f":"_xlfn.XLOOKUP($A81,[1]Inf_general_desarrollo!$A:$A,[1]Inf_general_desarrollo!$D:$D)","v":"45x75"},{"$f":"_xlfn.XLOOKUP($A81,[1]Inf_general_desarrollo!$A:$A,[1]Inf_general_desarrollo!$E:$E)","v":"Paredes texturizadas, pisos cerámicos, baños con placa en mármol con regaderas revestidas, espacio para closet."},{"$f":"_xlfn.XLOOKUP($A81,[1]Inf_general_desarrollo!$A:$A,[1]Inf_general_desarrollo!$F:$F)","v":"Huellas de cemento en cochera, vistas cerámicas tipo madera, ventanas con marco de aluminio."},{"$f":"_xlfn.XLOOKUP($A81,[1]Inf_general_desarrollo!$A:$A,[1]Inf_general_desarrollo!$G:$G)","v":"Yeso pulido"},{"$f":"_xlfn.XLOOKUP($A81,[1]Inf_general_desarrollo!$A:$A,[1]Inf_general_desarrollo!$I:$I)","v":"Concreto"}]
["Molino de las Flores","Horizontal","Loto",null,3,2,1,2,140,"128.65",8,"No",2,null,"Si","Si","Si","Boiler, lavadora, calentador de paso y preparación de minisplit. ",{"$f":"_xlfn.XLOOKUP(Tabla62[[#This Row],[Nombre_desarrollo]],[1]Inf_general_desarrollo!$A:$A,[1]Inf_general_desarrollo!$C:$C)","v":"Cerámico"},{"$f":"_xlfn.XLOOKUP($A82,[1]Inf_general_desarrollo!$A:$A,[1]Inf_general_desarrollo!$D:$D)","v":"60x60"},{"$f":"_xlfn.XLOOKUP($A82,[1]Inf_general_desarrollo!$A:$A,[1]Inf_general_desarrollo!$E:$E)","v":"Yeso pulido en paredes, cocina de mader ay melamina, piso de recamaras tipo madera 15x33."},{"$f":"_xlfn.XLOOKUP($A82,[1]Inf_general_desarrollo!$A:$A,[1]Inf_general_desarrollo!$F:$F)","v":"Vistas en piedra, loseta tpo madera."},{"$f":"_xlfn.XLOOKUP($A82,[1]Inf_general_desarrollo!$A:$A,[1]Inf_general_desarrollo!$G:$G)","v":"Yeso pulido"},{"$f":"_xlfn.XLOOKUP($A82,[1]Inf_general_desarrollo!$A:$A,[1]Inf_general_desarrollo!$I:$I)","v":"Concreto Hidráulico"}]
["Molino de las Flores","Horizontal","Anturio",null,4,3,0,2,140,"148.73",8,"No",2,null,"Si","Si","Si","Boiler, lavadora, calentador de paso y preparación de minisplit. ",{"$f":"_xlfn.XLOOKUP(Tabla62[[#This Row],[Nombre_desarrollo]],[1]Inf_general_desarrollo!$A:$A,[1]Inf_general_desarrollo!$C:$C)","v":"Cerámico"},{"$f":"_xlfn.XLOOKUP($A83,[1]Inf_general_desarrollo!$A:$A,[1]Inf_general_desarrollo!$D:$D)","v":"60x60"},{"$f":"_xlfn.XLOOKUP($A83,[1]Inf_general_desarrollo!$A:$A,[1]Inf_general_desarrollo!$E:$E)","v":"Yeso pulido en paredes, cocina de mader ay melamina, piso de recamaras tipo madera 15x33."},{"$f":"_xlfn.XLOOKUP($A83,[1]Inf_general_desarrollo!$A:$A,[1]Inf_general_desarrollo!$F:$F)","v":"Vistas en piedra, loseta tpo madera."},{"$f":"_xlfn.XLOOKUP($A83,[1]Inf_general_desarrollo!$A:$A,[1]Inf_general_desarrollo!$G:$G)","v":"Yeso pulido"},{"$f":"_xlfn.XLOOKUP($A83,[1]Inf_general_desarrollo!$A:$A,[1]Inf_general_desarrollo!$I:$I)","v":"Concreto Hidráulico"}]
["Molino de las Flores","Horizontal","Jacinto",null,4,3,0,2,140,"141.03",8,"No",2,null,"Si","Si","Si","Boiler, lavadora, calentador de paso y preparación de minisplit. ",{"$f":"_xlfn.XLOOKUP(Tabla62[[#This Row],[Nombre_desarrollo]],[1]Inf_general_desarrollo!$A:$A,[1]Inf_general_desarrollo!$C:$C)","v":"Cerámico"},{"$f":"_xlfn.XLOOKUP($A84,[1]Inf_general_desarrollo!$A:$A,[1]Inf_general_desarrollo!$D:$D)","v":"60x60"},{"$f":"_xlfn.XLOOKUP($A84,[1]Inf_general_desarrollo!$A:$A,[1]Inf_general_desarrollo!$E:$E)","v":"Yeso pulido en paredes, cocina de mader ay melamina, piso de recamaras tipo madera 15x33."},{"$f":"_xlfn.XLOOKUP($A84,[1]Inf_general_desarrollo!$A:$A,[1]Inf_general_desarrollo!$F:$F)","v":"Vistas en piedra, loseta tpo madera."},{"$f":"_xlfn.XLOOKUP($A84,[1]Inf_general_desarrollo!$A:$A,[1]Inf_general_desarrollo!$G:$G)","v":"Yeso pulido"},{"$f":"_xlfn.XLOOKUP($A84,[1]Inf_general_desarrollo!$A:$A,[1]Inf_general_desarrollo!$I:$I)","v":"Concreto Hidráulico"}]
["Molino de las Flores","Horizontal","Loto Plus",null,4,3,0,2,140,148,null,"No",2,null,"Si","Si","Si","Boiler, lavadora, calentador de paso y preparación de minisplit. ",{"$f":"_xlfn.XLOOKUP(Tabla62[[#This Row],[Nombre_desarrollo]],[1]Inf_general_desarrollo!$A:$A,[1]Inf_general_desarrollo!$C:$C)","v":"Cerámico"},{"$f":"_xlfn.XLOOKUP($A85,[1]Inf_general_desarrollo!$A:$A,[1]Inf_general_desarrollo!$D:$D)","v":"60x60"},{"$f":"_xlfn.XLOOKUP($A85,[1]Inf_general_desarrollo!$A:$A,[1]Inf_general_desarrollo!$E:$E)","v":"Yeso pulido en paredes, cocina de mader ay melamina, piso de recamaras tipo madera 15x33."},{"$f":"_xlfn.XLOOKUP($A85,[1]Inf_general_desarrollo!$A:$A,[1]Inf_general_desarrollo!$F:$F)","v":"Vistas en piedra, loseta tpo madera."},{"$f":"_xlfn.XLOOKUP($A85,[1]Inf_general_desarrollo!$A:$A,[1]Inf_general_desarrollo!$G:$G)","v":"Yeso pulido"},{"$f":"_xlfn.XLOOKUP($A85,[1]Inf_general_desarrollo!$A:$A,[1]Inf_general_desarrollo!$I:$I)","v":"Concreto Hidráulico"}]
["Molino de las Flores","Horizontal","Dahlia",null,3,3,0,2,140,145,null,"No",2,null,"Si","Si","Si","Boiler, lavadora, calentador de paso y preparación de minisplit. ",{"$f":"_xlfn.XLOOKUP(Tabla62[[#This Row],[Nombre_desarrollo]],[1]Inf_general_desarrollo!$A:$A,[1]Inf_general_desarrollo!$C:$C)","v":"Cerámico"},{"$f":"_xlfn.XLOOKUP($A86,[1]Inf_general_desarrollo!$A:$A,[1]Inf_general_desarrollo!$D:$D)","v":"60x60"},{"$f":"_xlfn.XLOOKUP($A86,[1]Inf_general_desarrollo!$A:$A,[1]Inf_general_desarrollo!$E:$E)","v":"Yeso pulido en paredes, cocina de mader ay melamina, piso de recamaras tipo madera 15x33."},{"$f":"_xlfn.XLOOKUP($A86,[1]Inf_general_desarrollo!$A:$A,[1]Inf_general_desarrollo!$F:$F)","v":"Vistas en piedra, loseta tpo madera."},{"$f":"_xlfn.XLOOKUP($A86,[1]Inf_general_desarrollo!$A:$A,[1]Inf_general_desarrollo!$G:$G)","v":"Yeso pulido"},{"$f":"_xlfn.XLOOKUP($A86,[1]Inf_general_desarrollo!$A:$A,[1]Inf_general_desarrollo!$I:$I)","v":"Concreto Hidráulico"}]
["Privada Santa Lucia","Horizontal","Aurora",null,3,2,0,2,145,"84.24",7,"No",1,null,"Si","Si","Si","Lavadora, secadora, gas, boiler.",{"$f":"_xlfn.XLOOKUP(Tabla62[[#This Row],[Nombre_desarrollo]],[1]Inf_general_desarrollo!$A:$A,[1]Inf_general_desarrollo!$C:$C)","v":"Cerámico"},{"$f":"_xlfn.XLOOKUP($A87,[1]Inf_general_desarrollo!$A:$A,[1]Inf_general_desarrollo!$D:$D)","v":"60x60"},{"$f":"_xlfn.XLOOKUP($A87,[1]Inf_general_desarrollo!$A:$A,[1]Inf_general_desarrollo!$E:$E)","v":"Yeso pulido, revestimiento en baños, acabados en pintura blanca."},{"$f":"_xlfn.XLOOKUP($A87,[1]Inf_general_desarrollo!$A:$A,[1]Inf_general_desarrollo!$F:$F)","v":"Cantera"},{"$f":"_xlfn.XLOOKUP($A87,[1]Inf_general_desarrollo!$A:$A,[1]Inf_general_desarrollo!$G:$G)","v":"Yeso pulido"},{"$f":"_xlfn.XLOOKUP($A87,[1]Inf_general_desarrollo!$A:$A,[1]Inf_general_desarrollo!$I:$I)","v":"Concreto Hidráulico"}]
["Privada Santa Lucia","Horizontal","Lucia",null,3,2,1,2,145,"116.79",7,"No",1,null,"Si","Si","Si","Lavadora, secadora, gas, boiler.",{"$f":"_xlfn.XLOOKUP(Tabla62[[#This Row],[Nombre_desarrollo]],[1]Inf_general_desarrollo!$A:$A,[1]Inf_general_desarrollo!$C:$C)","v":"Cerámico"},{"$f":"_xlfn.XLOOKUP($A88,[1]Inf_general_desarrollo!$A:$A,[1]Inf_general_desarrollo!$D:$D)","v":"60x60"},{"$f":"_xlfn.XLOOKUP($A88,[1]Inf_general_desarrollo!$A:$A,[1]Inf_general_desarrollo!$E:$E)","v":"Yeso pulido, revestimiento en baños, acabados en pintura blanca."},{"$f":"_xlfn.XLOOKUP($A88,[1]Inf_general_desarrollo!$A:$A,[1]Inf_general_desarrollo!$F:$F)","v":"Cantera"},{"$f":"_xlfn.XLOOKUP($A88,[1]Inf_general_desarrollo!$A:$A,[1]Inf_general_desarrollo!$G:$G)","v":"Yeso pulido"},{"$f":"_xlfn.XLOOKUP($A88,[1]Inf_general_desarrollo!$A:$A,[1]Inf_general_desarrollo!$I:$I)","v":"Concreto Hidráulico"}]
["Real del Sol","Horizontal","Jacaranda",null,2,1,1,2,72,"65.5",6,"No",1,null,"Si","Si","No","Instalaciones para boiler, gas, tinaco, lavadora.",{"$f":"_xlfn.XLOOKUP(Tabla62[[#This Row],[Nombre_desarrollo]],[1]Inf_general_desarrollo!$A:$A,[1]Inf_general_desarrollo!$C:$C)","v":"Cerámico"},{"$f":"_xlfn.XLOOKUP($A89,[1]Inf_general_desarrollo!$A:$A,[1]Inf_general_desarrollo!$D:$D)","v":"60x60"},{"$f":"_xlfn.XLOOKUP($A89,[1]Inf_general_desarrollo!$A:$A,[1]Inf_general_desarrollo!$E:$E)","v":"Enyesado, muebles de baño sencillos, pisos cerámicos"},{"$f":"_xlfn.XLOOKUP($A89,[1]Inf_general_desarrollo!$A:$A,[1]Inf_general_desarrollo!$F:$F)","v":"Protecciones de herreria"},{"$f":"_xlfn.XLOOKUP($A89,[1]Inf_general_desarrollo!$A:$A,[1]Inf_general_desarrollo!$G:$G)","v":"Yeso pulido"},{"$f":"_xlfn.XLOOKUP($A89,[1]Inf_general_desarrollo!$A:$A,[1]Inf_general_desarrollo!$I:$I)","v":"Concreto"}]
["Real del Sol","Horizontal","Roble",null,3,1,0,2,96,"77.37",6,"No",1,null,"Si","Si","No","Instalaciones para boiler, gas, tinaco, lavadora.",{"$f":"_xlfn.XLOOKUP(Tabla62[[#This Row],[Nombre_desarrollo]],[1]Inf_general_desarrollo!$A:$A,[1]Inf_general_desarrollo!$C:$C)","v":"Cerámico"},{"$f":"_xlfn.XLOOKUP($A90,[1]Inf_general_desarrollo!$A:$A,[1]Inf_general_desarrollo!$D:$D)","v":"60x60"},{"$f":"_xlfn.XLOOKUP($A90,[1]Inf_general_desarrollo!$A:$A,[1]Inf_general_desarrollo!$E:$E)","v":"Enyesado, muebles de baño sencillos, pisos cerámicos"},{"$f":"_xlfn.XLOOKUP($A90,[1]Inf_general_desarrollo!$A:$A,[1]Inf_general_desarrollo!$F:$F)","v":"Protecciones de herreria"},{"$f":"_xlfn.XLOOKUP($A90,[1]Inf_general_desarrollo!$A:$A,[1]Inf_general_desarrollo!$G:$G)","v":"Yeso pulido"},{"$f":"_xlfn.XLOOKUP($A90,[1]Inf_general_desarrollo!$A:$A,[1]Inf_general_desarrollo!$I:$I)","v":"Concreto"}]
["Real del Sol","Horizontal","Granado",null,3,2,0,1,96,62,6,"No",1,null,"Si","Si","No","Instalaciones para boiler, gas, tinaco, lavadora.",{"$f":"_xlfn.XLOOKUP(Tabla62[[#This Row],[Nombre_desarrollo]],[1]Inf_general_desarrollo!$A:$A,[1]Inf_general_desarrollo!$C:$C)","v":"Cerámico"},{"$f":"_xlfn.XLOOKUP($A91,[1]Inf_general_desarrollo!$A:$A,[1]Inf_general_desarrollo!$D:$D)","v":"60x60"},{"$f":"_xlfn.XLOOKUP($A91,[1]Inf_general_desarrollo!$A:$A,[1]Inf_general_desarrollo!$E:$E)","v":"Enyesado, muebles de baño sencillos, pisos cerámicos"},{"$f":"_xlfn.XLOOKUP($A91,[1]Inf_general_desarrollo!$A:$A,[1]Inf_general_desarrollo!$F:$F)","v":"Protecciones de herreria"},{"$f":"_xlfn.XLOOKUP($A91,[1]Inf_general_desarrollo!$A:$A,[1]Inf_general_desarrollo!$G:$G)","v":"Yeso pulido"},{"$f":"_xlfn.XLOOKUP($A91,[1]Inf_general_desarrollo!$A:$A,[1]Inf_general_desarrollo!$I:$I)","v":"Concreto"}]
["Real del Sol","Horizontal","Alamo",null,3,3,0,2,96,"92.84",6,"No",1,null,"Si","Si","No","Instalaciones para boiler, gas, tinaco, lavadora.",{"$f":"_xlfn.XLOOKUP(Tabla62[[#This Row],[Nombre_desarrollo]],[1]Inf_general_desarrollo!$A:$A,[1]Inf_general_desarrollo!$C:$C)","v":"Cerámico"},{"$f":"_xlfn.XLOOKUP($A92,[1]Inf_general_desarrollo!$A:$A,[1]Inf_general_desarrollo!$D:$D)","v":"60x60"},{"$f":"_xlfn.XLOOKUP($A92,[1]Inf_general_desarrollo!$A:$A,[1]Inf_general_desarrollo!$E:$E)","v":"Enyesado, muebles de baño sencillos, pisos cerámicos"},{"$f":"_xlfn.XLOOKUP($A92,[1]Inf_general_desarrollo!$A:$A,[1]Inf_general_desarrollo!$F:$F)","v":"Protecciones de herreria"},{"$f":"_xlfn.XLOOKUP($A92,[1]Inf_general_desarrollo!$A:$A,[1]Inf_general_desarrollo!$G:$G)","v":"Yeso pulido"},{"$f":"_xlfn.XLOOKUP($A92,[1]Inf_general_desarrollo!$A:$A,[1]Inf_general_desarrollo!$I:$I)","v":"Concreto"}]
["Reserva Quetzales","Horizontal","Zoomat",null,3,2,1,2,102,"101.05",6,"No",2,null,"Si","Si","Si","Preparación para minisplit, calentador solar, boiler y tinaco de 1000 lts.",{"$f":"_xlfn.XLOOKUP(Tabla62[[#This Row],[Nombre_desarrollo]],[1]Inf_general_desarrollo!$A:$A,[1]Inf_general_desarrollo!$C:$C)","v":"Cerámico"},{"$f":"_xlfn.XLOOKUP($A93,[1]Inf_general_desarrollo!$A:$A,[1]Inf_general_desarrollo!$D:$D)","v":"60x60"},{"$f":"_xlfn.XLOOKUP($A93,[1]Inf_general_desarrollo!$A:$A,[1]Inf_general_desarrollo!$E:$E)","v":"Paredes texturizadas, puertas en tambor, baños revestidos en azulejo, incluye accesorios de baño para colocar jabón y toalla."},{"$f":"_xlfn.XLOOKUP($A93,[1]Inf_general_desarrollo!$A:$A,[1]Inf_general_desarrollo!$F:$F)","v":"Huellas de cemento en cochera, y ventanas con marco de aluminio color blanco."},{"$f":"_xlfn.XLOOKUP($A93,[1]Inf_general_desarrollo!$A:$A,[1]Inf_general_desarrollo!$G:$G)","v":"Texturizada"},{"$f":"_xlfn.XLOOKUP($A93,[1]Inf_general_desarrollo!$A:$A,[1]Inf_general_desarrollo!$I:$I)","v":"Concreto Hidráulico"}]
["Reserva Quetzales","Horizontal","Mérida",null,4,3,0,2,102,108,6,"No",2,null,"Si","Si","Si","Preparación para minisplit, calentador solar, boiler y tinaco de 1000 lts.",{"$f":"_xlfn.XLOOKUP(Tabla62[[#This Row],[Nombre_desarrollo]],[1]Inf_general_desarrollo!$A:$A,[1]Inf_general_desarrollo!$C:$C)","v":"Cerámico"},{"$f":"_xlfn.XLOOKUP($A94,[1]Inf_general_desarrollo!$A:$A,[1]Inf_general_desarrollo!$D:$D)","v":"60x60"},{"$f":"_xlfn.XLOOKUP($A94,[1]Inf_general_desarrollo!$A:$A,[1]Inf_general_desarrollo!$E:$E)","v":"Paredes texturizadas, puertas en tambor, baños revestidos en azulejo, incluye accesorios de baño para colocar jabón y toalla."},{"$f":"_xlfn.XLOOKUP($A94,[1]Inf_general_desarrollo!$A:$A,[1]Inf_general_desarrollo!$F:$F)","v":"Huellas de cemento en cochera, y ventanas con marco de aluminio color blanco."},{"$f":"_xlfn.XLOOKUP($A94,[1]Inf_general_desarrollo!$A:$A,[1]Inf_general_desarrollo!$G:$G)","v":"Texturizada"},{"$f":"_xlfn.XLOOKUP($A94,[1]Inf_general_desarrollo!$A:$A,[1]Inf_general_desarrollo!$I:$I)","v":"Concreto Hidráulico"}]
["Residencial Desierto de los Leones","Horizontal","Dakar",null,3,4,0,2,144,166,8,"No",2,null,"Si","Si","Si","Calentador de paso y solar.",{"$f":"_xlfn.XLOOKUP(Tabla62[[#This Row],[Nombre_desarrollo]],[1]Inf_general_desarrollo!$A:$A,[1]Inf_general_desarrollo!$C:$C)","v":"Vitropiso"},{"$f":"_xlfn.XLOOKUP($A95,[1]Inf_general_desarrollo!$A:$A,[1]Inf_general_desarrollo!$D:$D)","v":"60x60"},{"$f":"_xlfn.XLOOKUP($A95,[1]Inf_general_desarrollo!$A:$A,[1]Inf_general_desarrollo!$E:$E)","v":"Aluminio blanco, incluye closet, accesorios de baño."},{"$f":"_xlfn.XLOOKUP($A95,[1]Inf_general_desarrollo!$A:$A,[1]Inf_general_desarrollo!$F:$F)","v":"Huellas de cemento en cochera, detalles en piedra y ventanas de aluminio blanco."},{"$f":"_xlfn.XLOOKUP($A95,[1]Inf_general_desarrollo!$A:$A,[1]Inf_general_desarrollo!$G:$G)","v":"Yeso pulido"},{"$f":"_xlfn.XLOOKUP($A95,[1]Inf_general_desarrollo!$A:$A,[1]Inf_general_desarrollo!$I:$I)","v":"Concreto"}]
["Residencial Desierto de los Leones","Horizontal","Kalahari",null,3,3,0,2,144,"161.24",8,"No",2,null,"Si","Si","Si","Calentador de paso y solar.",{"$f":"_xlfn.XLOOKUP(Tabla62[[#This Row],[Nombre_desarrollo]],[1]Inf_general_desarrollo!$A:$A,[1]Inf_general_desarrollo!$C:$C)","v":"Vitropiso"},{"$f":"_xlfn.XLOOKUP($A96,[1]Inf_general_desarrollo!$A:$A,[1]Inf_general_desarrollo!$D:$D)","v":"60x60"},{"$f":"_xlfn.XLOOKUP($A96,[1]Inf_general_desarrollo!$A:$A,[1]Inf_general_desarrollo!$E:$E)","v":"Aluminio blanco, incluye closet, accesorios de baño."},{"$f":"_xlfn.XLOOKUP($A96,[1]Inf_general_desarrollo!$A:$A,[1]Inf_general_desarrollo!$F:$F)","v":"Huellas de cemento en cochera, detalles en piedra y ventanas de aluminio blanco."},{"$f":"_xlfn.XLOOKUP($A96,[1]Inf_general_desarrollo!$A:$A,[1]Inf_general_desarrollo!$G:$G)","v":"Yeso pulido"},{"$f":"_xlfn.XLOOKUP($A96,[1]Inf_general_desarrollo!$A:$A,[1]Inf_general_desarrollo!$I:$I)","v":"Concreto"}]
["Residencial Desierto de los Leones","Horizontal","Palmyra",null,3,3,1,2,188,157,8,"No",2,null,"Si","Si","Si","Calentador de paso y solar.",{"$f":"_xlfn.XLOOKUP(Tabla62[[#This Row],[Nombre_desarrollo]],[1]Inf_general_desarrollo!$A:$A,[1]Inf_general_desarrollo!$C:$C)","v":"Vitropiso"},{"$f":"_xlfn.XLOOKUP($A97,[1]Inf_general_desarrollo!$A:$A,[1]Inf_general_desarrollo!$D:$D)","v":"60x60"},{"$f":"_xlfn.XLOOKUP($A97,[1]Inf_general_desarrollo!$A:$A,[1]Inf_general_desarrollo!$E:$E)","v":"Aluminio blanco, incluye closet, accesorios de baño."},{"$f":"_xlfn.XLOOKUP($A97,[1]Inf_general_desarrollo!$A:$A,[1]Inf_general_desarrollo!$F:$F)","v":"Huellas de cemento en cochera, detalles en piedra y ventanas de aluminio blanco."},{"$f":"_xlfn.XLOOKUP($A97,[1]Inf_general_desarrollo!$A:$A,[1]Inf_general_desarrollo!$G:$G)","v":"Yeso pulido"},{"$f":"_xlfn.XLOOKUP($A97,[1]Inf_general_desarrollo!$A:$A,[1]Inf_general_desarrollo!$I:$I)","v":"Concreto"}]
["Ronda Residencial","Horizontal","Marbella",null,3,3,1,2,"115.5","151.92",7,"No",2,null,"Si","Si","Si","Calentador de paso",{"$f":"_xlfn.XLOOKUP(Tabla62[[#This Row],[Nombre_desarrollo]],[1]Inf_general_desarrollo!$A:$A,[1]Inf_general_desarrollo!$C:$C)","v":"Cerámico"},{"$f":"_xlfn.XLOOKUP($A98,[1]Inf_general_desarrollo!$A:$A,[1]Inf_general_desarrollo!$D:$D)","v":"60x60"},{"$f":"_xlfn.XLOOKUP($A98,[1]Inf_general_desarrollo!$A:$A,[1]Inf_general_desarrollo!$E:$E)","v":"Accesorios de baño, paredes en yeso."},{"$f":"_xlfn.XLOOKUP($A98,[1]Inf_general_desarrollo!$A:$A,[1]Inf_general_desarrollo!$F:$F)","v":"Huellas de cemento en cochera"},{"$f":"_xlfn.XLOOKUP($A98,[1]Inf_general_desarrollo!$A:$A,[1]Inf_general_desarrollo!$G:$G)","v":"Yeso pulido"},{"$f":"_xlfn.XLOOKUP($A98,[1]Inf_general_desarrollo!$A:$A,[1]Inf_general_desarrollo!$I:$I)","v":"Concreto"}]
["Ronda Residencial","Horizontal","Gelsa",null,3,3,0,2,"115.5","130.33",7,"No",2,null,"Si","Si","Si","Calentador de paso",{"$f":"_xlfn.XLOOKUP(Tabla62[[#This Row],[Nombre_desarrollo]],[1]Inf_general_desarrollo!$A:$A,[1]Inf_general_desarrollo!$C:$C)","v":"Cerámico"},{"$f":"_xlfn.XLOOKUP($A99,[1]Inf_general_desarrollo!$A:$A,[1]Inf_general_desarrollo!$D:$D)","v":"60x60"},{"$f":"_xlfn.XLOOKUP($A99,[1]Inf_general_desarrollo!$A:$A,[1]Inf_general_desarrollo!$E:$E)","v":"Accesorios de baño, paredes en yeso."},{"$f":"_xlfn.XLOOKUP($A99,[1]Inf_general_desarrollo!$A:$A,[1]Inf_general_desarrollo!$F:$F)","v":"Huellas de cemento en cochera"},{"$f":"_xlfn.XLOOKUP($A99,[1]Inf_general_desarrollo!$A:$A,[1]Inf_general_desarrollo!$G:$G)","v":"Yeso pulido"},{"$f":"_xlfn.XLOOKUP($A99,[1]Inf_general_desarrollo!$A:$A,[1]Inf_general_desarrollo!$I:$I)","v":"Concreto"}]
["Ronda Residencial","Horizontal","Borja",null,3,2,1,2,"115.5","118.26",7,"No",2,null,"Si","Si","Si","Calentador de paso",{"$f":"_xlfn.XLOOKUP(Tabla62[[#This Row],[Nombre_desarrollo]],[1]Inf_general_desarrollo!$A:$A,[1]Inf_general_desarrollo!$C:$C)","v":"Cerámico"},{"$f":"_xlfn.XLOOKUP($A100,[1]Inf_general_desarrollo!$A:$A,[1]Inf_general_desarrollo!$D:$D)","v":"60x60"},{"$f":"_xlfn.XLOOKUP($A100,[1]Inf_general_desarrollo!$A:$A,[1]Inf_general_desarrollo!$E:$E)","v":"Accesorios de baño, paredes en yeso."},{"$f":"_xlfn.XLOOKUP($A100,[1]Inf_general_desarrollo!$A:$A,[1]Inf_general_desarrollo!$F:$F)","v":"Huellas de cemento en cochera"},{"$f":"_xlfn.XLOOKUP($A100,[1]Inf_general_desarrollo!$A:$A,[1]Inf_general_desarrollo!$G:$G)","v":"Yeso pulido"},{"$f":"_xlfn.XLOOKUP($A100,[1]Inf_general_desarrollo!$A:$A,[1]Inf_general_desarrollo!$I:$I)","v":"Concreto"}]
["Ronda Residencial","Horizontal","Neiva",null,2,2,0,2,"115.5","90.1",7,"No",2,null,"Si","Si","Si","Calentador de paso",{"$f":"_xlfn.XLOOKUP(Tabla62[[#This Row],[Nombre_desarrollo]],[1]Inf_general_desarrollo!$A:$A,[1]Inf_general_desarrollo!$C:$C)","v":"Cerámico"},{"$f":"_xlfn.XLOOKUP($A101,[1]Inf_general_desarrollo!$A:$A,[1]Inf_general_desarrollo!$D:$D)","v":"60x60"},{"$f":"_xlfn.XLOOKUP($A101,[1]Inf_general_desarrollo!$A:$A,[1]Inf_general_desarrollo!$E:$E)","v":"Accesorios de baño, paredes en yeso."},{"$f":"_xlfn.XLOOKUP($A101,[1]Inf_general_desarrollo!$A:$A,[1]Inf_general_desarrollo!$F:$F)","v":"Huellas de cemento en cochera"},{"$f":"_xlfn.XLOOKUP($A101,[1]Inf_general_desarrollo!$A:$A,[1]Inf_general_desarrollo!$G:$G)","v":"Yeso pulido"},{"$f":"_xlfn.XLOOKUP($A101,[1]Inf_general_desarrollo!$A:$A,[1]Inf_general_desarrollo!$I:$I)","v":"Concreto"}]
["Ronda Residencial","Horizontal","Guinea",null,3,2,1,2,"115.5","144.8",7,"No",2,null,"Si","Si","Si","Calentador de paso",{"$f":"_xlfn.XLOOKUP(Tabla62[[#This Row],[Nombre_desarrollo]],[1]Inf_general_desarrollo!$A:$A,[1]Inf_general_desarrollo!$C:$C)","v":"Cerámico"},{"$f":"_xlfn.XLOOKUP($A102,[1]Inf_general_desarrollo!$A:$A,[1]Inf_general_desarrollo!$D:$D)","v":"60x60"},{"$f":"_xlfn.XLOOKUP($A102,[1]Inf_general_desarrollo!$A:$A,[1]Inf_general_desarrollo!$E:$E)","v":"Accesorios de baño, paredes en yeso."},{"$f":"_xlfn.XLOOKUP($A102,[1]Inf_general_desarrollo!$A:$A,[1]Inf_general_desarrollo!$F:$F)","v":"Huellas de cemento en cochera"},{"$f":"_xlfn.XLOOKUP($A102,[1]Inf_general_desarrollo!$A:$A,[1]Inf_general_desarrollo!$G:$G)","v":"Yeso pulido"},{"$f":"_xlfn.XLOOKUP($A102,[1]Inf_general_desarrollo!$A:$A,[1]Inf_general_desarrollo!$I:$I)","v":"Concreto"}]
["San Gerardo Residencial","Horizontal","Berlín",null,3,2,1,2,120,"99.88",6,"No",2,null,"Si","Si","Si","Boiler, preparación para calentador solar.",{"$f":"_xlfn.XLOOKUP(Tabla62[[#This Row],[Nombre_desarrollo]],[1]Inf_general_desarrollo!$A:$A,[1]Inf_general_desarrollo!$C:$C)","v":"Cerámico"},{"$f":"_xlfn.XLOOKUP($A103,[1]Inf_general_desarrollo!$A:$A,[1]Inf_general_desarrollo!$D:$D)","v":"60x60"},{"$f":"_xlfn.XLOOKUP($A103,[1]Inf_general_desarrollo!$A:$A,[1]Inf_general_desarrollo!$E:$E)","v":"Paredes en yeso pulido, muebles de baño y accesorios,"},{"$f":"_xlfn.XLOOKUP($A103,[1]Inf_general_desarrollo!$A:$A,[1]Inf_general_desarrollo!$F:$F)","v":"Cochera con huellas de cemento, detalles tipo piedra, ventanas con marco de aluminio."},{"$f":"_xlfn.XLOOKUP($A103,[1]Inf_general_desarrollo!$A:$A,[1]Inf_general_desarrollo!$G:$G)","v":"Yeso pulido"},{"$f":"_xlfn.XLOOKUP($A103,[1]Inf_general_desarrollo!$A:$A,[1]Inf_general_desarrollo!$I:$I)","v":"Concreto"}]
["San Gerardo Residencial","Horizontal","Malaga",null,3,3,0,2,120,"97.92",6,"No",2,null,"Si","Si","Si","Boiler, preparación para calentador solar.",{"$f":"_xlfn.XLOOKUP(Tabla62[[#This Row],[Nombre_desarrollo]],[1]Inf_general_desarrollo!$A:$A,[1]Inf_general_desarrollo!$C:$C)","v":"Cerámico"},{"$f":"_xlfn.XLOOKUP($A104,[1]Inf_general_desarrollo!$A:$A,[1]Inf_general_desarrollo!$D:$D)","v":"60x60"},{"$f":"_xlfn.XLOOKUP($A104,[1]Inf_general_desarrollo!$A:$A,[1]Inf_general_desarrollo!$E:$E)","v":"Paredes en yeso pulido, muebles de baño y accesorios,"},{"$f":"_xlfn.XLOOKUP($A104,[1]Inf_general_desarrollo!$A:$A,[1]Inf_general_desarrollo!$F:$F)","v":"Cochera con huellas de cemento, detalles tipo piedra, ventanas con marco de aluminio."},{"$f":"_xlfn.XLOOKUP($A104,[1]Inf_general_desarrollo!$A:$A,[1]Inf_general_desarrollo!$G:$G)","v":"Yeso pulido"},{"$f":"_xlfn.XLOOKUP($A104,[1]Inf_general_desarrollo!$A:$A,[1]Inf_general_desarrollo!$I:$I)","v":"Concreto"}]
["San Gerardo Residencial","Horizontal","Noria",null,2,1,1,2,75,"62.86",5,"No",2,null,"Si","Si","Si","Boiler, preparación para calentador solar.",{"$f":"_xlfn.XLOOKUP(Tabla62[[#This Row],[Nombre_desarrollo]],[1]Inf_general_desarrollo!$A:$A,[1]Inf_general_desarrollo!$C:$C)","v":"Cerámico"},{"$f":"_xlfn.XLOOKUP($A105,[1]Inf_general_desarrollo!$A:$A,[1]Inf_general_desarrollo!$D:$D)","v":"60x60"},{"$f":"_xlfn.XLOOKUP($A105,[1]Inf_general_desarrollo!$A:$A,[1]Inf_general_desarrollo!$E:$E)","v":"Paredes en yeso pulido, muebles de baño y accesorios,"},{"$f":"_xlfn.XLOOKUP($A105,[1]Inf_general_desarrollo!$A:$A,[1]Inf_general_desarrollo!$F:$F)","v":"Cochera con huellas de cemento, detalles tipo piedra, ventanas con marco de aluminio."},{"$f":"_xlfn.XLOOKUP($A105,[1]Inf_general_desarrollo!$A:$A,[1]Inf_general_desarrollo!$G:$G)","v":"Yeso pulido"},{"$f":"_xlfn.XLOOKUP($A105,[1]Inf_general_desarrollo!$A:$A,[1]Inf_general_desarrollo!$I:$I)","v":"Concreto"}]
["San Gerardo Residencial","Horizontal","Berlín_Exc",null,3,2,1,2,"166.8","99.88","8.34","No",2,null,"Si","Si","Si","Boiler, preparación para calentador solar.",{"$f":"_xlfn.XLOOKUP(Tabla62[[#This Row],[Nombre_desarrollo]],[1]Inf_general_desarrollo!$A:$A,[1]Inf_general_desarrollo!$C:$C)","v":"Cerámico"},{"$f":"_xlfn.XLOOKUP($A106,[1]Inf_general_desarrollo!$A:$A,[1]Inf_general_desarrollo!$D:$D)","v":"60x60"},{"$f":"_xlfn.XLOOKUP($A106,[1]Inf_general_desarrollo!$A:$A,[1]Inf_general_desarrollo!$E:$E)","v":"Paredes en yeso pulido, muebles de baño y accesorios,"},{"$f":"_xlfn.XLOOKUP($A106,[1]Inf_general_desarrollo!$A:$A,[1]Inf_general_desarrollo!$F:$F)","v":"Cochera con huellas de cemento, detalles tipo piedra, ventanas con marco de aluminio."},{"$f":"_xlfn.XLOOKUP($A106,[1]Inf_general_desarrollo!$A:$A,[1]Inf_general_desarrollo!$G:$G)","v":"Yeso pulido"},{"$f":"_xlfn.XLOOKUP($A106,[1]Inf_general_desarrollo!$A:$A,[1]Inf_general_desarrollo!$I:$I)","v":"Concreto"}]
["San Gerardo Residencial- Etapa 32","Horizontal","Austria",null,3,2,1,2,160,166,8,"No",2,null,"Si","Si","Si","Instalación para gas natural y minisplit.",{"$f":"_xlfn.XLOOKUP(Tabla62[[#This Row],[Nombre_desarrollo]],[1]Inf_general_desarrollo!$A:$A,[1]Inf_general_desarrollo!$C:$C)","v":"Cerámico"},{"$f":"_xlfn.XLOOKUP($A107,[1]Inf_general_desarrollo!$A:$A,[1]Inf_general_desarrollo!$D:$D)","v":"60x60"},{"$f":"_xlfn.XLOOKUP($A107,[1]Inf_general_desarrollo!$A:$A,[1]Inf_general_desarrollo!$E:$E)","v":"Paredes en yeso pulido, muebles de baño y accesorios,"},{"$f":"_xlfn.XLOOKUP($A107,[1]Inf_general_desarrollo!$A:$A,[1]Inf_general_desarrollo!$F:$F)","v":"Cochera con huellas de cemento, detalles tipo piedra, ventanas con marco de aluminio."},{"$f":"_xlfn.XLOOKUP($A107,[1]Inf_general_desarrollo!$A:$A,[1]Inf_general_desarrollo!$G:$G)","v":"Yeso pulido"},{"$f":"_xlfn.XLOOKUP($A107,[1]Inf_general_desarrollo!$A:$A,[1]Inf_general_desarrollo!$I:$I)","v":"Concreto"}]
["San Gerardo Residencial- Etapa 32","Horizontal","Acerina Especial",null,3,2,1,2,380.46,145.26,"-","No",2,null,"Si","Si","Si","Instalación para gas natural y minisplit.",{"$f":"_xlfn.XLOOKUP(Tabla62[[#This Row],[Nombre_desarrollo]],[1]Inf_general_desarrollo!$A:$A,[1]Inf_general_desarrollo!$C:$C)","v":"Cerámico"},{"$f":"_xlfn.XLOOKUP($A108,[1]Inf_general_desarrollo!$A:$A,[1]Inf_general_desarrollo!$D:$D)","v":"60x60"},{"$f":"_xlfn.XLOOKUP($A108,[1]Inf_general_desarrollo!$A:$A,[1]Inf_general_desarrollo!$E:$E)","v":"Paredes en yeso pulido, muebles de baño y accesorios,"},{"$f":"_xlfn.XLOOKUP($A108,[1]Inf_general_desarrollo!$A:$A,[1]Inf_general_desarrollo!$F:$F)","v":"Cochera con huellas de cemento, detalles tipo piedra, ventanas con marco de aluminio."},{"$f":"_xlfn.XLOOKUP($A108,[1]Inf_general_desarrollo!$A:$A,[1]Inf_general_desarrollo!$G:$G)","v":"Yeso pulido"},{"$f":"_xlfn.XLOOKUP($A108,[1]Inf_general_desarrollo!$A:$A,[1]Inf_general_desarrollo!$I:$I)","v":"Concreto"}]
["San Gerardo Residencial- Etapa 32","Horizontal","Acerina",null,3,2,1,2,159.76,142,8,"No",2,null,"Si","Si","Si","Instalación para gas natural y minisplit.",{"$f":"_xlfn.XLOOKUP(Tabla62[[#This Row],[Nombre_desarrollo]],[1]Inf_general_desarrollo!$A:$A,[1]Inf_general_desarrollo!$C:$C)","v":"Cerámico"},{"$f":"_xlfn.XLOOKUP($A109,[1]Inf_general_desarrollo!$A:$A,[1]Inf_general_desarrollo!$D:$D)","v":"60x60"},{"$f":"_xlfn.XLOOKUP($A109,[1]Inf_general_desarrollo!$A:$A,[1]Inf_general_desarrollo!$E:$E)","v":"Paredes en yeso pulido, muebles de baño y accesorios,"},{"$f":"_xlfn.XLOOKUP($A109,[1]Inf_general_desarrollo!$A:$A,[1]Inf_general_desarrollo!$F:$F)","v":"Cochera con huellas de cemento, detalles tipo piedra, ventanas con marco de aluminio."},{"$f":"_xlfn.XLOOKUP($A109,[1]Inf_general_desarrollo!$A:$A,[1]Inf_general_desarrollo!$G:$G)","v":"Yeso pulido"},{"$f":"_xlfn.XLOOKUP($A109,[1]Inf_general_desarrollo!$A:$A,[1]Inf_general_desarrollo!$I:$I)","v":"Concreto"}]
["San Gerardo Residencial- Etapa 32","Horizontal","Viena Especial",null,3,2,1,2,277.64999999999998,113.15,7,"No",2,null,"Si","Si","Si","Instalación para gas natural y minisplit.",{"$f":"_xlfn.XLOOKUP(Tabla62[[#This Row],[Nombre_desarrollo]],[1]Inf_general_desarrollo!$A:$A,[1]Inf_general_desarrollo!$C:$C)","v":"Cerámico"},{"$f":"_xlfn.XLOOKUP($A110,[1]Inf_general_desarrollo!$A:$A,[1]Inf_general_desarrollo!$D:$D)","v":"60x60"},{"$f":"_xlfn.XLOOKUP($A110,[1]Inf_general_desarrollo!$A:$A,[1]Inf_general_desarrollo!$E:$E)","v":"Paredes en yeso pulido, muebles de baño y accesorios,"},{"$f":"_xlfn.XLOOKUP($A110,[1]Inf_general_desarrollo!$A:$A,[1]Inf_general_desarrollo!$F:$F)","v":"Cochera con huellas de cemento, detalles tipo piedra, ventanas con marco de aluminio."},{"$f":"_xlfn.XLOOKUP($A110,[1]Inf_general_desarrollo!$A:$A,[1]Inf_general_desarrollo!$G:$G)","v":"Yeso pulido"},{"$f":"_xlfn.XLOOKUP($A110,[1]Inf_general_desarrollo!$A:$A,[1]Inf_general_desarrollo!$I:$I)","v":"Concreto"}]
["San Gerardo Residencial- Etapa 32","Horizontal","Viena Ampliada",null,3,2,1,2,139.79,131.19999999999999,7,"No",2,null,"Si","Si","Si","Instalación para gas natural y minisplit.",{"$f":"_xlfn.XLOOKUP(Tabla62[[#This Row],[Nombre_desarrollo]],[1]Inf_general_desarrollo!$A:$A,[1]Inf_general_desarrollo!$C:$C)","v":"Cerámico"},{"$f":"_xlfn.XLOOKUP($A111,[1]Inf_general_desarrollo!$A:$A,[1]Inf_general_desarrollo!$D:$D)","v":"60x60"},{"$f":"_xlfn.XLOOKUP($A111,[1]Inf_general_desarrollo!$A:$A,[1]Inf_general_desarrollo!$E:$E)","v":"Paredes en yeso pulido, muebles de baño y accesorios,"},{"$f":"_xlfn.XLOOKUP($A111,[1]Inf_general_desarrollo!$A:$A,[1]Inf_general_desarrollo!$F:$F)","v":"Cochera con huellas de cemento, detalles tipo piedra, ventanas con marco de aluminio."},{"$f":"_xlfn.XLOOKUP($A111,[1]Inf_general_desarrollo!$A:$A,[1]Inf_general_desarrollo!$G:$G)","v":"Yeso pulido"},{"$f":"_xlfn.XLOOKUP($A111,[1]Inf_general_desarrollo!$A:$A,[1]Inf_general_desarrollo!$I:$I)","v":"Concreto"}]
["San Gerardo Residencial- Etapa 32","Horizontal","Italia",null,3,2,1,2,354.44,191.58,18,"No",2,null,"Si","Si","Si","Instalación para gas natural y minisplit.",{"$f":"_xlfn.XLOOKUP(Tabla62[[#This Row],[Nombre_desarrollo]],[1]Inf_general_desarrollo!$A:$A,[1]Inf_general_desarrollo!$C:$C)","v":"Cerámico"},{"$f":"_xlfn.XLOOKUP($A112,[1]Inf_general_desarrollo!$A:$A,[1]Inf_general_desarrollo!$D:$D)","v":"60x60"},{"$f":"_xlfn.XLOOKUP($A112,[1]Inf_general_desarrollo!$A:$A,[1]Inf_general_desarrollo!$E:$E)","v":"Paredes en yeso pulido, muebles de baño y accesorios,"},{"$f":"_xlfn.XLOOKUP($A112,[1]Inf_general_desarrollo!$A:$A,[1]Inf_general_desarrollo!$F:$F)","v":"Cochera con huellas de cemento, detalles tipo piedra, ventanas con marco de aluminio."},{"$f":"_xlfn.XLOOKUP($A112,[1]Inf_general_desarrollo!$A:$A,[1]Inf_general_desarrollo!$G:$G)","v":"Yeso pulido"},{"$f":"_xlfn.XLOOKUP($A112,[1]Inf_general_desarrollo!$A:$A,[1]Inf_general_desarrollo!$I:$I)","v":"Concreto"}]
["San Gerardo Residencial-Etapa 31","Horizontal","Noria",null,2,1,1,2,75,"62.86",5,"No",2,null,"Si","Si","Si","Boiler, preparación para calentador solar.",{"$f":"_xlfn.XLOOKUP(Tabla62[[#This Row],[Nombre_desarrollo]],[1]Inf_general_desarrollo!$A:$A,[1]Inf_general_desarrollo!$C:$C)","v":"Cerámico"},{"$f":"_xlfn.XLOOKUP($A113,[1]Inf_general_desarrollo!$A:$A,[1]Inf_general_desarrollo!$D:$D)","v":"60x60"},{"$f":"_xlfn.XLOOKUP($A113,[1]Inf_general_desarrollo!$A:$A,[1]Inf_general_desarrollo!$E:$E)","v":"Paredes en yeso pulido, muebles de baño y accesorios,"},{"$f":"_xlfn.XLOOKUP($A113,[1]Inf_general_desarrollo!$A:$A,[1]Inf_general_desarrollo!$F:$F)","v":"Cochera con huellas de cemento, detalles tipo piedra, ventanas con marco de aluminio."},{"$f":"_xlfn.XLOOKUP($A113,[1]Inf_general_desarrollo!$A:$A,[1]Inf_general_desarrollo!$G:$G)","v":"Yeso pulido"},{"$f":"_xlfn.XLOOKUP($A113,[1]Inf_general_desarrollo!$A:$A,[1]Inf_general_desarrollo!$I:$I)","v":"Concreto"}]
["Stacia","Horizontal","Gea",null,3,2,0,1,119,90,7,"No",2,null,"Si","Si","Si","Calentador solar.",{"$f":"_xlfn.XLOOKUP(Tabla62[[#This Row],[Nombre_desarrollo]],[1]Inf_general_desarrollo!$A:$A,[1]Inf_general_desarrollo!$C:$C)","v":"Cerámico"},{"$f":"_xlfn.XLOOKUP($A114,[1]Inf_general_desarrollo!$A:$A,[1]Inf_general_desarrollo!$D:$D)","v":"40x60"},{"$f":"_xlfn.XLOOKUP($A114,[1]Inf_general_desarrollo!$A:$A,[1]Inf_general_desarrollo!$E:$E)","v":"Espacios para closet, paredes en yeso pulido, cristal templado en escaleras, accesorios de baño."},{"$f":"_xlfn.XLOOKUP($A114,[1]Inf_general_desarrollo!$A:$A,[1]Inf_general_desarrollo!$F:$F)","v":"Cochera con huellas de concreto y jardín, aluminio negro y detalles en cantera."},{"$f":"_xlfn.XLOOKUP($A114,[1]Inf_general_desarrollo!$A:$A,[1]Inf_general_desarrollo!$G:$G)","v":"Yeso pulido"},{"$f":"_xlfn.XLOOKUP($A114,[1]Inf_general_desarrollo!$A:$A,[1]Inf_general_desarrollo!$I:$I)","v":"Concreto"}]
["Stacia","Horizontal","Eros",null,3,3,0,2,119,102,7,"No",2,null,"Si","Si","Si","Calentador solar.",{"$f":"_xlfn.XLOOKUP(Tabla62[[#This Row],[Nombre_desarrollo]],[1]Inf_general_desarrollo!$A:$A,[1]Inf_general_desarrollo!$C:$C)","v":"Cerámico"},{"$f":"_xlfn.XLOOKUP($A115,[1]Inf_general_desarrollo!$A:$A,[1]Inf_general_desarrollo!$D:$D)","v":"40x60"},{"$f":"_xlfn.XLOOKUP($A115,[1]Inf_general_desarrollo!$A:$A,[1]Inf_general_desarrollo!$E:$E)","v":"Espacios para closet, paredes en yeso pulido, cristal templado en escaleras, accesorios de baño."},{"$f":"_xlfn.XLOOKUP($A115,[1]Inf_general_desarrollo!$A:$A,[1]Inf_general_desarrollo!$F:$F)","v":"Cochera con huellas de concreto y jardín, aluminio negro y detalles en cantera."},{"$f":"_xlfn.XLOOKUP($A115,[1]Inf_general_desarrollo!$A:$A,[1]Inf_general_desarrollo!$G:$G)","v":"Yeso pulido"},{"$f":"_xlfn.XLOOKUP($A115,[1]Inf_general_desarrollo!$A:$A,[1]Inf_general_desarrollo!$I:$I)","v":"Concreto"}]
["Stacia","Horizontal","Talos",null,4,3,0,2,119,147,7,"No",2,null,"Si","Si","Si","Preparación para minisplit y calentador solar.",{"$f":"_xlfn.XLOOKUP(Tabla62[[#This Row],[Nombre_desarrollo]],[1]Inf_general_desarrollo!$A:$A,[1]Inf_general_desarrollo!$C:$C)","v":"Cerámico"},{"$f":"_xlfn.XLOOKUP($A116,[1]Inf_general_desarrollo!$A:$A,[1]Inf_general_desarrollo!$D:$D)","v":"40x60"},{"$f":"_xlfn.XLOOKUP($A116,[1]Inf_general_desarrollo!$A:$A,[1]Inf_general_desarrollo!$E:$E)","v":"Espacios para closet, paredes en yeso pulido, cristal templado en escaleras, accesorios de baño."},{"$f":"_xlfn.XLOOKUP($A116,[1]Inf_general_desarrollo!$A:$A,[1]Inf_general_desarrollo!$F:$F)","v":"Cochera con huellas de concreto y jardín, aluminio negro y detalles en cantera."},{"$f":"_xlfn.XLOOKUP($A116,[1]Inf_general_desarrollo!$A:$A,[1]Inf_general_desarrollo!$G:$G)","v":"Yeso pulido"},{"$f":"_xlfn.XLOOKUP($A116,[1]Inf_general_desarrollo!$A:$A,[1]Inf_general_desarrollo!$I:$I)","v":"Concreto"}]
["Stacia","Horizontal","Ares",null,3,2,1,2,119,"122.55",7,"No",2,null,"Si","Si","Si","Preparación para minisplit y calentador solar.",{"$f":"_xlfn.XLOOKUP(Tabla62[[#This Row],[Nombre_desarrollo]],[1]Inf_general_desarrollo!$A:$A,[1]Inf_general_desarrollo!$C:$C)","v":"Cerámico"},{"$f":"_xlfn.XLOOKUP($A117,[1]Inf_general_desarrollo!$A:$A,[1]Inf_general_desarrollo!$D:$D)","v":"40x60"},{"$f":"_xlfn.XLOOKUP($A117,[1]Inf_general_desarrollo!$A:$A,[1]Inf_general_desarrollo!$E:$E)","v":"Espacios para closet, paredes en yeso pulido, cristal templado en escaleras, accesorios de baño."},{"$f":"_xlfn.XLOOKUP($A117,[1]Inf_general_desarrollo!$A:$A,[1]Inf_general_desarrollo!$F:$F)","v":"Cochera con huellas de concreto y jardín, aluminio negro y detalles en cantera."},{"$f":"_xlfn.XLOOKUP($A117,[1]Inf_general_desarrollo!$A:$A,[1]Inf_general_desarrollo!$G:$G)","v":"Yeso pulido"},{"$f":"_xlfn.XLOOKUP($A117,[1]Inf_general_desarrollo!$A:$A,[1]Inf_general_desarrollo!$I:$I)","v":"Concreto"}]
["Stacia","Horizontal","Enio",null,2,2,1,2,119,106,7,"No",2,null,"Si","Si","Si","Preparación para minisplit y calentador solar.",{"$f":"_xlfn.XLOOKUP(Tabla62[[#This Row],[Nombre_desarrollo]],[1]Inf_general_desarrollo!$A:$A,[1]Inf_general_desarrollo!$C:$C)","v":"Cerámico"},{"$f":"_xlfn.XLOOKUP($A118,[1]Inf_general_desarrollo!$A:$A,[1]Inf_general_desarrollo!$D:$D)","v":"40x60"},{"$f":"_xlfn.XLOOKUP($A118,[1]Inf_general_desarrollo!$A:$A,[1]Inf_general_desarrollo!$E:$E)","v":"Espacios para closet, paredes en yeso pulido, cristal templado en escaleras, accesorios de baño."},{"$f":"_xlfn.XLOOKUP($A118,[1]Inf_general_desarrollo!$A:$A,[1]Inf_general_desarrollo!$F:$F)","v":"Cochera con huellas de concreto y jardín, aluminio negro y detalles en cantera."},{"$f":"_xlfn.XLOOKUP($A118,[1]Inf_general_desarrollo!$A:$A,[1]Inf_general_desarrollo!$G:$G)","v":"Yeso pulido"},{"$f":"_xlfn.XLOOKUP($A118,[1]Inf_general_desarrollo!$A:$A,[1]Inf_general_desarrollo!$I:$I)","v":"Concreto"}]
["Stacia-Sub etapa 2","Horizontal","Gea",null,3,2,0,1,119,90,7,"No",2,null,"Si","Si","Si","Calentador solar.",{"$f":"_xlfn.XLOOKUP(Tabla62[[#This Row],[Nombre_desarrollo]],[1]Inf_general_desarrollo!$A:$A,[1]Inf_general_desarrollo!$C:$C)","v":"Cerámico"},{"$f":"_xlfn.XLOOKUP($A119,[1]Inf_general_desarrollo!$A:$A,[1]Inf_general_desarrollo!$D:$D)","v":"40x60"},{"$f":"_xlfn.XLOOKUP($A119,[1]Inf_general_desarrollo!$A:$A,[1]Inf_general_desarrollo!$E:$E)","v":"Espacios para closet, paredes en yeso pulido, cristal templado en escaleras, accesorios de baño."},{"$f":"_xlfn.XLOOKUP($A119,[1]Inf_general_desarrollo!$A:$A,[1]Inf_general_desarrollo!$F:$F)","v":"Cochera con huellas de concreto y jardín, aluminio negro y detalles en cantera."},{"$f":"_xlfn.XLOOKUP($A119,[1]Inf_general_desarrollo!$A:$A,[1]Inf_general_desarrollo!$G:$G)","v":"Yeso pulido"},{"$f":"_xlfn.XLOOKUP($A119,[1]Inf_general_desarrollo!$A:$A,[1]Inf_general_desarrollo!$I:$I)","v":"Concreto"}]
["Stacia-Sub etapa 2","Horizontal","Eros",null,3,3,0,2,119,102,7,"No",2,null,"Si","Si","Si","Calentador solar.",{"$f":"_xlfn.XLOOKUP(Tabla62[[#This Row],[Nombre_desarrollo]],[1]Inf_general_desarrollo!$A:$A,[1]Inf_general_desarrollo!$C:$C)","v":"Cerámico"},{"$f":"_xlfn.XLOOKUP($A120,[1]Inf_general_desarrollo!$A:$A,[1]Inf_general_desarrollo!$D:$D)","v":"40x60"},{"$f":"_xlfn.XLOOKUP($A120,[1]Inf_general_desarrollo!$A:$A,[1]Inf_general_desarrollo!$E:$E)","v":"Espacios para closet, paredes en yeso pulido, cristal templado en escaleras, accesorios de baño."},{"$f":"_xlfn.XLOOKUP($A120,[1]Inf_general_desarrollo!$A:$A,[1]Inf_general_desarrollo!$F:$F)","v":"Cochera con huellas de concreto y jardín, aluminio negro y detalles en cantera."},{"$f":"_xlfn.XLOOKUP($A120,[1]Inf_general_desarrollo!$A:$A,[1]Inf_general_desarrollo!$G:$G)","v":"Yeso pulido"},{"$f":"_xlfn.XLOOKUP($A120,[1]Inf_general_desarrollo!$A:$A,[1]Inf_general_desarrollo!$I:$I)","v":"Concreto"}]
["Stacia-Sub etapa 2","Horizontal","Talos",null,4,3,0,2,119,147,7,"No",2,null,"Si","Si","Si","Preparación para minisplit y calentador solar.",{"$f":"_xlfn.XLOOKUP(Tabla62[[#This Row],[Nombre_desarrollo]],[1]Inf_general_desarrollo!$A:$A,[1]Inf_general_desarrollo!$C:$C)","v":"Cerámico"},{"$f":"_xlfn.XLOOKUP($A121,[1]Inf_general_desarrollo!$A:$A,[1]Inf_general_desarrollo!$D:$D)","v":"40x60"},{"$f":"_xlfn.XLOOKUP($A121,[1]Inf_general_desarrollo!$A:$A,[1]Inf_general_desarrollo!$E:$E)","v":"Espacios para closet, paredes en yeso pulido, cristal templado en escaleras, accesorios de baño."},{"$f":"_xlfn.XLOOKUP($A121,[1]Inf_general_desarrollo!$A:$A,[1]Inf_general_desarrollo!$F:$F)","v":"Cochera con huellas de concreto y jardín, aluminio negro y detalles en cantera."},{"$f":"_xlfn.XLOOKUP($A121,[1]Inf_general_desarrollo!$A:$A,[1]Inf_general_desarrollo!$G:$G)","v":"Yeso pulido"},{"$f":"_xlfn.XLOOKUP($A121,[1]Inf_general_desarrollo!$A:$A,[1]Inf_general_desarrollo!$I:$I)","v":"Concreto"}]
["Stacia-Sub etapa 2","Horizontal","Ares",null,3,2,1,2,119,"122.55",7,"No",2,null,"Si","Si","Si","Preparación para minisplit y calentador solar.",{"$f":"_xlfn.XLOOKUP(Tabla62[[#This Row],[Nombre_desarrollo]],[1]Inf_general_desarrollo!$A:$A,[1]Inf_general_desarrollo!$C:$C)","v":"Cerámico"},{"$f":"_xlfn.XLOOKUP($A122,[1]Inf_general_desarrollo!$A:$A,[1]Inf_general_desarrollo!$D:$D)","v":"40x60"},{"$f":"_xlfn.XLOOKUP($A122,[1]Inf_general_desarrollo!$A:$A,[1]Inf_general_desarrollo!$E:$E)","v":"Espacios para closet, paredes en yeso pulido, cristal templado en escaleras, accesorios de baño."},{"$f":"_xlfn.XLOOKUP($A122,[1]Inf_general_desarrollo!$A:$A,[1]Inf_general_desarrollo!$F:$F)","v":"Cochera con huellas de concreto y jardín, aluminio negro y detalles en cantera."},{"$f":"_xlfn.XLOOKUP($A122,[1]Inf_general_desarrollo!$A:$A,[1]Inf_general_desarrollo!$G:$G)","v":"Yeso pulido"},{"$f":"_xlfn.XLOOKUP($A122,[1]Inf_general_desarrollo!$A:$A,[1]Inf_general_desarrollo!$I:$I)","v":"Concreto"}]
["Stacia-Sub etapa 2","Horizontal","Enio",null,2,2,1,2,119,106,7,"No",2,null,"Si","Si","Si","Preparación para minisplit y calentador solar.",{"$f":"_xlfn.XLOOKUP(Tabla62[[#This Row],[Nombre_desarrollo]],[1]Inf_general_desarrollo!$A:$A,[1]Inf_general_desarrollo!$C:$C)","v":"Cerámico"},{"$f":"_xlfn.XLOOKUP($A123,[1]Inf_general_desarrollo!$A:$A,[1]Inf_general_desarrollo!$D:$D)","v":"40x60"},{"$f":"_xlfn.XLOOKUP($A123,[1]Inf_general_desarrollo!$A:$A,[1]Inf_general_desarrollo!$E:$E)","v":"Espacios para closet, paredes en yeso pulido, cristal templado en escaleras, accesorios de baño."},{"$f":"_xlfn.XLOOKUP($A123,[1]Inf_general_desarrollo!$A:$A,[1]Inf_general_desarrollo!$F:$F)","v":"Cochera con huellas de concreto y jardín, aluminio negro y detalles en cantera."},{"$f":"_xlfn.XLOOKUP($A123,[1]Inf_general_desarrollo!$A:$A,[1]Inf_general_desarrollo!$G:$G)","v":"Yeso pulido"},{"$f":"_xlfn.XLOOKUP($A123,[1]Inf_general_desarrollo!$A:$A,[1]Inf_general_desarrollo!$I:$I)","v":"Concreto"}]
["Stacia-Sub etapa 2","Horizontal","Nerea",null,3,2,1,2,119,105,7,"No",2,null,"Si","Si","Si","Preparación para minisplit y calentador solar.",{"$f":"_xlfn.XLOOKUP(Tabla62[[#This Row],[Nombre_desarrollo]],[1]Inf_general_desarrollo!$A:$A,[1]Inf_general_desarrollo!$C:$C)","v":"Cerámico"},{"$f":"_xlfn.XLOOKUP($A124,[1]Inf_general_desarrollo!$A:$A,[1]Inf_general_desarrollo!$D:$D)","v":"40x60"},{"$f":"_xlfn.XLOOKUP($A124,[1]Inf_general_desarrollo!$A:$A,[1]Inf_general_desarrollo!$E:$E)","v":"Espacios para closet, paredes en yeso pulido, cristal templado en escaleras, accesorios de baño."},{"$f":"_xlfn.XLOOKUP($A124,[1]Inf_general_desarrollo!$A:$A,[1]Inf_general_desarrollo!$F:$F)","v":"Cochera con huellas de concreto y jardín, aluminio negro y detalles en cantera."},{"$f":"_xlfn.XLOOKUP($A124,[1]Inf_general_desarrollo!$A:$A,[1]Inf_general_desarrollo!$G:$G)","v":"Yeso pulido"},{"$f":"_xlfn.XLOOKUP($A124,[1]Inf_general_desarrollo!$A:$A,[1]Inf_general_desarrollo!$I:$I)","v":"Concreto"}]
["Terralta Norte","Horizontal","Conde",null,3,2,1,2,"123.12","152.81","9.85","No",2,null,"Si","Si","Si","Instalación para gas natural y minisplit.",{"$f":"_xlfn.XLOOKUP(Tabla62[[#This Row],[Nombre_desarrollo]],[1]Inf_general_desarrollo!$A:$A,[1]Inf_general_desarrollo!$C:$C)","v":"Cerámico"},{"$f":"_xlfn.XLOOKUP($A125,[1]Inf_general_desarrollo!$A:$A,[1]Inf_general_desarrollo!$D:$D)","v":"60x60"},{"$f":"_xlfn.XLOOKUP($A125,[1]Inf_general_desarrollo!$A:$A,[1]Inf_general_desarrollo!$E:$E)","v":"Yeso pulido, pintura blanca, cocina con acabados de granito."},{"$f":"_xlfn.XLOOKUP($A125,[1]Inf_general_desarrollo!$A:$A,[1]Inf_general_desarrollo!$F:$F)","v":"Vistas de cantera"},{"$f":"_xlfn.XLOOKUP($A125,[1]Inf_general_desarrollo!$A:$A,[1]Inf_general_desarrollo!$G:$G)","v":"Yeso pulido"},{"$f":"_xlfn.XLOOKUP($A125,[1]Inf_general_desarrollo!$A:$A,[1]Inf_general_desarrollo!$I:$I)","v":"Concreto Hidráulico"}]
["Terralta Norte","Horizontal","Duqiesa",null,3,2,1,2,"123.12","163.86","9.85","No",2,null,"Si","Si","Si","Instalación para gas natural y minisplit.",{"$f":"_xlfn.XLOOKUP(Tabla62[[#This Row],[Nombre_desarrollo]],[1]Inf_general_desarrollo!$A:$A,[1]Inf_general_desarrollo!$C:$C)","v":"Cerámico"},{"$f":"_xlfn.XLOOKUP($A126,[1]Inf_general_desarrollo!$A:$A,[1]Inf_general_desarrollo!$D:$D)","v":"60x60"},{"$f":"_xlfn.XLOOKUP($A126,[1]Inf_general_desarrollo!$A:$A,[1]Inf_general_desarrollo!$E:$E)","v":"Yeso pulido, pintura blanca, cocina con acabados de granito."},{"$f":"_xlfn.XLOOKUP($A126,[1]Inf_general_desarrollo!$A:$A,[1]Inf_general_desarrollo!$F:$F)","v":"Vistas de cantera"},{"$f":"_xlfn.XLOOKUP($A126,[1]Inf_general_desarrollo!$A:$A,[1]Inf_general_desarrollo!$G:$G)","v":"Yeso pulido"},{"$f":"_xlfn.XLOOKUP($A126,[1]Inf_general_desarrollo!$A:$A,[1]Inf_general_desarrollo!$I:$I)","v":"Concreto Hidráulico"}]
["Terralta Norte","Horizontal","Condesa",null,3,2,1,2,"123.12",152.81,"9.85","No",2,null,"Si","Si","Si","Instalación para gas natural y minisplit.",{"$f":"_xlfn.XLOOKUP(Tabla62[[#This Row],[Nombre_desarrollo]],[1]Inf_general_desarrollo!$A:$A,[1]Inf_general_desarrollo!$C:$C)","v":"Cerámico"},{"$f":"_xlfn.XLOOKUP($A127,[1]Inf_general_desarrollo!$A:$A,[1]Inf_general_desarrollo!$D:$D)","v":"60x60"},{"$f":"_xlfn.XLOOKUP($A127,[1]Inf_general_desarrollo!$A:$A,[1]Inf_general_desarrollo!$E:$E)","v":"Yeso pulido, pintura blanca, cocina con acabados de granito."},{"$f":"_xlfn.XLOOKUP($A127,[1]Inf_general_desarrollo!$A:$A,[1]Inf_general_desarrollo!$F:$F)","v":"Vistas de cantera"},{"$f":"_xlfn.XLOOKUP($A127,[1]Inf_general_desarrollo!$A:$A,[1]Inf_general_desarrollo!$G:$G)","v":"Yeso pulido"},{"$f":"_xlfn.XLOOKUP($A127,[1]Inf_general_desarrollo!$A:$A,[1]Inf_general_desarrollo!$I:$I)","v":"Concreto Hidráulico"}]
["Toscana Platinum","Horizontal","Verona",null,3,3,0,2,120,"130.78",6,"No",2,null,"Si","Si","Si","Preparación para minisplit, boiler",{"$f":"_xlfn.XLOOKUP(Tabla62[[#This Row],[Nombre_desarrollo]],[1]Inf_general_desarrollo!$A:$A,[1]Inf_general_desarrollo!$C:$C)","v":"Cerámico"},{"$f":"_xlfn.XLOOKUP($A128,[1]Inf_general_desarrollo!$A:$A,[1]Inf_general_desarrollo!$D:$D)","v":"60x60"},{"$f":"_xlfn.XLOOKUP($A128,[1]Inf_general_desarrollo!$A:$A,[1]Inf_general_desarrollo!$E:$E)","v":"Paredes en yeso, closet incluidos, accesorios de baño, cocina en granito."},{"$f":"_xlfn.XLOOKUP($A128,[1]Inf_general_desarrollo!$A:$A,[1]Inf_general_desarrollo!$F:$F)","v":"Cochera con concreto, ventanas con marco de aluminio y acabados en imitación piedra."},{"$f":"_xlfn.XLOOKUP($A128,[1]Inf_general_desarrollo!$A:$A,[1]Inf_general_desarrollo!$G:$G)","v":"Yeso pulido"},{"$f":"_xlfn.XLOOKUP($A128,[1]Inf_general_desarrollo!$A:$A,[1]Inf_general_desarrollo!$I:$I)","v":"Concreto"}]
["Toscana Platinum","Horizontal","Verona Ampliada",null,3,3,1,2,120,140,6,"No",2,null,"Si","Si","Si","Preparación para minisplit, boiler",{"$f":"_xlfn.XLOOKUP(Tabla62[[#This Row],[Nombre_desarrollo]],[1]Inf_general_desarrollo!$A:$A,[1]Inf_general_desarrollo!$C:$C)","v":"Cerámico"},{"$f":"_xlfn.XLOOKUP($A129,[1]Inf_general_desarrollo!$A:$A,[1]Inf_general_desarrollo!$D:$D)","v":"60x60"},{"$f":"_xlfn.XLOOKUP($A129,[1]Inf_general_desarrollo!$A:$A,[1]Inf_general_desarrollo!$E:$E)","v":"Paredes en yeso, closet incluidos, accesorios de baño, cocina en granito."},{"$f":"_xlfn.XLOOKUP($A129,[1]Inf_general_desarrollo!$A:$A,[1]Inf_general_desarrollo!$F:$F)","v":"Cochera con concreto, ventanas con marco de aluminio y acabados en imitación piedra."},{"$f":"_xlfn.XLOOKUP($A129,[1]Inf_general_desarrollo!$A:$A,[1]Inf_general_desarrollo!$G:$G)","v":"Yeso pulido"},{"$f":"_xlfn.XLOOKUP($A129,[1]Inf_general_desarrollo!$A:$A,[1]Inf_general_desarrollo!$I:$I)","v":"Concreto"}]
["Toscana Platinum","Horizontal","Milan",null,3,2,0,1,170,"116.22","2022-05-08","No",2,null,"Si","Si","Si","Preparación para minisplit, boiler",{"$f":"_xlfn.XLOOKUP(Tabla62[[#This Row],[Nombre_desarrollo]],[1]Inf_general_desarrollo!$A:$A,[1]Inf_general_desarrollo!$C:$C)","v":"Cerámico"},{"$f":"_xlfn.XLOOKUP($A130,[1]Inf_general_desarrollo!$A:$A,[1]Inf_general_desarrollo!$D:$D)","v":"60x60"},{"$f":"_xlfn.XLOOKUP($A130,[1]Inf_general_desarrollo!$A:$A,[1]Inf_general_desarrollo!$E:$E)","v":"Paredes en yeso, closet incluidos, accesorios de baño, cocina en granito."},{"$f":"_xlfn.XLOOKUP($A130,[1]Inf_general_desarrollo!$A:$A,[1]Inf_general_desarrollo!$F:$F)","v":"Cochera con concreto, ventanas con marco de aluminio y acabados en imitación piedra."},{"$f":"_xlfn.XLOOKUP($A130,[1]Inf_general_desarrollo!$A:$A,[1]Inf_general_desarrollo!$G:$G)","v":"Yeso pulido"},{"$f":"_xlfn.XLOOKUP($A130,[1]Inf_general_desarrollo!$A:$A,[1]Inf_general_desarrollo!$I:$I)","v":"Concreto"}]
["Toscana Platinum","Horizontal","Catania",null,3,3,1,2,120,"119.71",6,"No",2,null,"Si","Si","Si","Preparación para minisplit, boiler",{"$f":"_xlfn.XLOOKUP(Tabla62[[#This Row],[Nombre_desarrollo]],[1]Inf_general_desarrollo!$A:$A,[1]Inf_general_desarrollo!$C:$C)","v":"Cerámico"},{"$f":"_xlfn.XLOOKUP($A131,[1]Inf_general_desarrollo!$A:$A,[1]Inf_general_desarrollo!$D:$D)","v":"60x60"},{"$f":"_xlfn.XLOOKUP($A131,[1]Inf_general_desarrollo!$A:$A,[1]Inf_general_desarrollo!$E:$E)","v":"Paredes en yeso, closet incluidos, accesorios de baño, cocina en granito."},{"$f":"_xlfn.XLOOKUP($A131,[1]Inf_general_desarrollo!$A:$A,[1]Inf_general_desarrollo!$F:$F)","v":"Cochera con concreto, ventanas con marco de aluminio y acabados en imitación piedra."},{"$f":"_xlfn.XLOOKUP($A131,[1]Inf_general_desarrollo!$A:$A,[1]Inf_general_desarrollo!$G:$G)","v":"Yeso pulido"},{"$f":"_xlfn.XLOOKUP($A131,[1]Inf_general_desarrollo!$A:$A,[1]Inf_general_desarrollo!$I:$I)","v":"Concreto"}]
["Toscana Platinum","Horizontal","Lucca",null,2,2,1,2,120,106,6,"No",2,null,"Si","Si","Si","Preparación para minisplit, boiler",{"$f":"_xlfn.XLOOKUP(Tabla62[[#This Row],[Nombre_desarrollo]],[1]Inf_general_desarrollo!$A:$A,[1]Inf_general_desarrollo!$C:$C)","v":"Cerámico"},{"$f":"_xlfn.XLOOKUP($A132,[1]Inf_general_desarrollo!$A:$A,[1]Inf_general_desarrollo!$D:$D)","v":"60x60"},{"$f":"_xlfn.XLOOKUP($A132,[1]Inf_general_desarrollo!$A:$A,[1]Inf_general_desarrollo!$E:$E)","v":"Paredes en yeso, closet incluidos, accesorios de baño, cocina en granito."},{"$f":"_xlfn.XLOOKUP($A132,[1]Inf_general_desarrollo!$A:$A,[1]Inf_general_desarrollo!$F:$F)","v":"Cochera con concreto, ventanas con marco de aluminio y acabados en imitación piedra."},{"$f":"_xlfn.XLOOKUP($A132,[1]Inf_general_desarrollo!$A:$A,[1]Inf_general_desarrollo!$G:$G)","v":"Yeso pulido"},{"$f":"_xlfn.XLOOKUP($A132,[1]Inf_general_desarrollo!$A:$A,[1]Inf_general_desarrollo!$I:$I)","v":"Concreto"}]
["Toscana Platinum","Horizontal","Siena",null,3,2,1,2,120,121,6,"No",2,null,"Si","Si","Si","Preparación para minisplit, boiler",{"$f":"_xlfn.XLOOKUP(Tabla62[[#This Row],[Nombre_desarrollo]],[1]Inf_general_desarrollo!$A:$A,[1]Inf_general_desarrollo!$C:$C)","v":"Cerámico"},{"$f":"_xlfn.XLOOKUP($A133,[1]Inf_general_desarrollo!$A:$A,[1]Inf_general_desarrollo!$D:$D)","v":"60x60"},{"$f":"_xlfn.XLOOKUP($A133,[1]Inf_general_desarrollo!$A:$A,[1]Inf_general_desarrollo!$E:$E)","v":"Paredes en yeso, closet incluidos, accesorios de baño, cocina en granito."},{"$f":"_xlfn.XLOOKUP($A133,[1]Inf_general_desarrollo!$A:$A,[1]Inf_general_desarrollo!$F:$F)","v":"Cochera con concreto, ventanas con marco de aluminio y acabados en imitación piedra."},{"$f":"_xlfn.XLOOKUP($A133,[1]Inf_general_desarrollo!$A:$A,[1]Inf_general_desarrollo!$G:$G)","v":"Yeso pulido"},{"$f":"_xlfn.XLOOKUP($A133,[1]Inf_general_desarrollo!$A:$A,[1]Inf_general_desarrollo!$I:$I)","v":"Concreto"}]
["Verona Residencial","Horizontal","Trivoli",null,3,1,1,1,"122.50","91.34",7,"No",1,null,"Si","Si","Si","Boiler, gas, lavadora y preparación para minisplit.",{"$f":"_xlfn.XLOOKUP(Tabla62[[#This Row],[Nombre_desarrollo]],[1]Inf_general_desarrollo!$A:$A,[1]Inf_general_desarrollo!$C:$C)","v":"Cerámico"},{"$f":"_xlfn.XLOOKUP($A134,[1]Inf_general_desarrollo!$A:$A,[1]Inf_general_desarrollo!$D:$D)","v":"60x60"},{"$f":"_xlfn.XLOOKUP($A134,[1]Inf_general_desarrollo!$A:$A,[1]Inf_general_desarrollo!$E:$E)","v":"Yeso pulido en paredes, acabados en pintura blanca, cocina de melamina."},{"$f":"_xlfn.XLOOKUP($A134,[1]Inf_general_desarrollo!$A:$A,[1]Inf_general_desarrollo!$F:$F)","v":"Vistas fachaleta tipo madera"},{"$f":"_xlfn.XLOOKUP($A134,[1]Inf_general_desarrollo!$A:$A,[1]Inf_general_desarrollo!$G:$G)","v":"Yeso pulido"},{"$f":"_xlfn.XLOOKUP($A134,[1]Inf_general_desarrollo!$A:$A,[1]Inf_general_desarrollo!$I:$I)","v":"Concreto Hidráulico"}]
["Verona Residencial","Horizontal","Dubai",null,3,3,1,2,"122.50","137.62",7,"No",2,null,"Si","Si","Si","Boiler, gas, lavadora y preparación para minisplit.",{"$f":"_xlfn.XLOOKUP(Tabla62[[#This Row],[Nombre_desarrollo]],[1]Inf_general_desarrollo!$A:$A,[1]Inf_general_desarrollo!$C:$C)","v":"Cerámico"},{"$f":"_xlfn.XLOOKUP($A135,[1]Inf_general_desarrollo!$A:$A,[1]Inf_general_desarrollo!$D:$D)","v":"60x60"},{"$f":"_xlfn.XLOOKUP($A135,[1]Inf_general_desarrollo!$A:$A,[1]Inf_general_desarrollo!$E:$E)","v":"Yeso pulido en paredes, acabados en pintura blanca, cocina de melamina."},{"$f":"_xlfn.XLOOKUP($A135,[1]Inf_general_desarrollo!$A:$A,[1]Inf_general_desarrollo!$F:$F)","v":"Vistas fachaleta tipo madera"},{"$f":"_xlfn.XLOOKUP($A135,[1]Inf_general_desarrollo!$A:$A,[1]Inf_general_desarrollo!$G:$G)","v":"Yeso pulido"},{"$f":"_xlfn.XLOOKUP($A135,[1]Inf_general_desarrollo!$A:$A,[1]Inf_general_desarrollo!$I:$I)","v":"Concreto Hidráulico"}]
["Verona Residencial","Horizontal","Antigua",null,3,2,1,2,"122.50","131.62",7,"No",2,null,"Si","Si","Si","Boiler, gas, lavadora y preparación para minisplit.",{"$f":"_xlfn.XLOOKUP(Tabla62[[#This Row],[Nombre_desarrollo]],[1]Inf_general_desarrollo!$A:$A,[1]Inf_general_desarrollo!$C:$C)","v":"Cerámico"},{"$f":"_xlfn.XLOOKUP($A136,[1]Inf_general_desarrollo!$A:$A,[1]Inf_general_desarrollo!$D:$D)","v":"60x60"},{"$f":"_xlfn.XLOOKUP($A136,[1]Inf_general_desarrollo!$A:$A,[1]Inf_general_desarrollo!$E:$E)","v":"Yeso pulido en paredes, acabados en pintura blanca, cocina de melamina."},{"$f":"_xlfn.XLOOKUP($A136,[1]Inf_general_desarrollo!$A:$A,[1]Inf_general_desarrollo!$F:$F)","v":"Vistas fachaleta tipo madera"},{"$f":"_xlfn.XLOOKUP($A136,[1]Inf_general_desarrollo!$A:$A,[1]Inf_general_desarrollo!$G:$G)","v":"Yeso pulido"},{"$f":"_xlfn.XLOOKUP($A136,[1]Inf_general_desarrollo!$A:$A,[1]Inf_general_desarrollo!$I:$I)","v":"Concreto Hidráulico"}]
["Verona Residencial","Horizontal","Magna",null,2,2,1,2,"114.27","97.94",6,"No",2,null,"Si","Si","Si","Boiler, gas, lavadora y preparación para minisplit.",{"$f":"_xlfn.XLOOKUP(Tabla62[[#This Row],[Nombre_desarrollo]],[1]Inf_general_desarrollo!$A:$A,[1]Inf_general_desarrollo!$C:$C)","v":"Cerámico"},{"$f":"_xlfn.XLOOKUP($A137,[1]Inf_general_desarrollo!$A:$A,[1]Inf_general_desarrollo!$D:$D)","v":"60x60"},{"$f":"_xlfn.XLOOKUP($A137,[1]Inf_general_desarrollo!$A:$A,[1]Inf_general_desarrollo!$E:$E)","v":"Yeso pulido en paredes, acabados en pintura blanca, cocina de melamina."},{"$f":"_xlfn.XLOOKUP($A137,[1]Inf_general_desarrollo!$A:$A,[1]Inf_general_desarrollo!$F:$F)","v":"Vistas fachaleta tipo madera"},{"$f":"_xlfn.XLOOKUP($A137,[1]Inf_general_desarrollo!$A:$A,[1]Inf_general_desarrollo!$G:$G)","v":"Yeso pulido"},{"$f":"_xlfn.XLOOKUP($A137,[1]Inf_general_desarrollo!$A:$A,[1]Inf_general_desarrollo!$I:$I)","v":"Concreto Hidráulico"}]
["Villa de las Norias","Horizontal","Balsas",null,3,1,1,2,90,"66.48",6,"No",2,null,"No","Si","Si","Boiler.",{"$f":"_xlfn.XLOOKUP(Tabla62[[#This Row],[Nombre_desarrollo]],[1]Inf_general_desarrollo!$A:$A,[1]Inf_general_desarrollo!$C:$C)","v":"Cerámico"},{"$f":"_xlfn.XLOOKUP($A138,[1]Inf_general_desarrollo!$A:$A,[1]Inf_general_desarrollo!$D:$D)","v":"40x40"},{"$f":"_xlfn.XLOOKUP($A138,[1]Inf_general_desarrollo!$A:$A,[1]Inf_general_desarrollo!$E:$E)","v":"Aluminio blanco, muebles de baño sencillos, cluye closet."},{"$f":"_xlfn.XLOOKUP($A138,[1]Inf_general_desarrollo!$A:$A,[1]Inf_general_desarrollo!$F:$F)","v":"Huellas de cemento, ventanas con marco de aluminio blanco."},{"$f":"_xlfn.XLOOKUP($A138,[1]Inf_general_desarrollo!$A:$A,[1]Inf_general_desarrollo!$G:$G)","v":"Yeso"},{"$f":"_xlfn.XLOOKUP($A138,[1]Inf_general_desarrollo!$A:$A,[1]Inf_general_desarrollo!$I:$I)","v":"Concreto"}]
["Villa de las Norias","Horizontal","Grijalva",null,2,1,1,2,90,"67.99",6,"No",2,null,"No","Si","Si","Boiler.",{"$f":"_xlfn.XLOOKUP(Tabla62[[#This Row],[Nombre_desarrollo]],[1]Inf_general_desarrollo!$A:$A,[1]Inf_general_desarrollo!$C:$C)","v":"Cerámico"},{"$f":"_xlfn.XLOOKUP($A139,[1]Inf_general_desarrollo!$A:$A,[1]Inf_general_desarrollo!$D:$D)","v":"40x40"},{"$f":"_xlfn.XLOOKUP($A139,[1]Inf_general_desarrollo!$A:$A,[1]Inf_general_desarrollo!$E:$E)","v":"Aluminio blanco, muebles de baño sencillos, cluye closet."},{"$f":"_xlfn.XLOOKUP($A139,[1]Inf_general_desarrollo!$A:$A,[1]Inf_general_desarrollo!$F:$F)","v":"Huellas de cemento, ventanas con marco de aluminio blanco."},{"$f":"_xlfn.XLOOKUP($A139,[1]Inf_general_desarrollo!$A:$A,[1]Inf_general_desarrollo!$G:$G)","v":"Yeso"},{"$f":"_xlfn.XLOOKUP($A139,[1]Inf_general_desarrollo!$A:$A,[1]Inf_general_desarrollo!$I:$I)","v":"Concreto"}]
["Villa de las Norias","Horizontal","Ameca",null,3,1,1,2,90,72,6,"No",2,null,"No","Si","Si","Boiler.",{"$f":"_xlfn.XLOOKUP(Tabla62[[#This Row],[Nombre_desarrollo]],[1]Inf_general_desarrollo!$A:$A,[1]Inf_general_desarrollo!$C:$C)","v":"Cerámico"},{"$f":"_xlfn.XLOOKUP($A140,[1]Inf_general_desarrollo!$A:$A,[1]Inf_general_desarrollo!$D:$D)","v":"40x40"},{"$f":"_xlfn.XLOOKUP($A140,[1]Inf_general_desarrollo!$A:$A,[1]Inf_general_desarrollo!$E:$E)","v":"Aluminio blanco, muebles de baño sencillos, cluye closet."},{"$f":"_xlfn.XLOOKUP($A140,[1]Inf_general_desarrollo!$A:$A,[1]Inf_general_desarrollo!$F:$F)","v":"Huellas de cemento, ventanas con marco de aluminio blanco."},{"$f":"_xlfn.XLOOKUP($A140,[1]Inf_general_desarrollo!$A:$A,[1]Inf_general_desarrollo!$G:$G)","v":"Yeso"},{"$f":"_xlfn.XLOOKUP($A140,[1]Inf_general_desarrollo!$A:$A,[1]Inf_general_desarrollo!$I:$I)","v":"Concreto"}]
["Villa de las Norias","Horizontal","Pirul",null,2,1,1,2,75,63.85,6,"No",2,null,"No","Si","Si","Boiler.",{"$f":"_xlfn.XLOOKUP(Tabla62[[#This Row],[Nombre_desarrollo]],[1]Inf_general_desarrollo!$A:$A,[1]Inf_general_desarrollo!$C:$C)","v":"Cerámico"},{"$f":"_xlfn.XLOOKUP($A141,[1]Inf_general_desarrollo!$A:$A,[1]Inf_general_desarrollo!$D:$D)","v":"40x40"},{"$f":"_xlfn.XLOOKUP($A141,[1]Inf_general_desarrollo!$A:$A,[1]Inf_general_desarrollo!$E:$E)","v":"Aluminio blanco, muebles de baño sencillos, cluye closet."},{"$f":"_xlfn.XLOOKUP($A141,[1]Inf_general_desarrollo!$A:$A,[1]Inf_general_desarrollo!$F:$F)","v":"Huellas de cemento, ventanas con marco de aluminio blanco."},{"$f":"_xlfn.XLOOKUP($A141,[1]Inf_general_desarrollo!$A:$A,[1]Inf_general_desarrollo!$G:$G)","v":"Yeso"},{"$f":"_xlfn.XLOOKUP($A141,[1]Inf_general_desarrollo!$A:$A,[1]Inf_general_desarrollo!$I:$I)","v":"Concreto"}]
["Villa de las Norias","Horizontal","Nazas",null,2,1,1,2,90,72,6,"No",2,null,"No","Si","Si","Boiler.",{"$f":"_xlfn.XLOOKUP(Tabla62[[#This Row],[Nombre_desarrollo]],[1]Inf_general_desarrollo!$A:$A,[1]Inf_general_desarrollo!$C:$C)","v":"Cerámico"},{"$f":"_xlfn.XLOOKUP($A142,[1]Inf_general_desarrollo!$A:$A,[1]Inf_general_desarrollo!$D:$D)","v":"40x40"},{"$f":"_xlfn.XLOOKUP($A142,[1]Inf_general_desarrollo!$A:$A,[1]Inf_general_desarrollo!$E:$E)","v":"Aluminio blanco, muebles de baño sencillos, cluye closet."},{"$f":"_xlfn.XLOOKUP($A142,[1]Inf_general_desarrollo!$A:$A,[1]Inf_general_desarrollo!$F:$F)","v":"Huellas de cemento, ventanas con marco de aluminio blanco."},{"$f":"_xlfn.XLOOKUP($A142,[1]Inf_general_desarrollo!$A:$A,[1]Inf_general_desarrollo!$G:$G)","v":"Yeso"},{"$f":"_xlfn.XLOOKUP($A142,[1]Inf_general_desarrollo!$A:$A,[1]Inf_general_desarrollo!$I:$I)","v":"Concreto"}]
["Villa Fontana","Horizontal","Antigua",null,3,2,1,2,96,"130.64",6,"No",2,null,"Si","Si","Si","Instalaciones para boiler, gas, tinaco, lavadora.",{"$f":"_xlfn.XLOOKUP(Tabla62[[#This Row],[Nombre_desarrollo]],[1]Inf_general_desarrollo!$A:$A,[1]Inf_general_desarrollo!$C:$C)","v":"Cerámico"},{"$f":"_xlfn.XLOOKUP($A143,[1]Inf_general_desarrollo!$A:$A,[1]Inf_general_desarrollo!$D:$D)","v":"60x60"},{"$f":"_xlfn.XLOOKUP($A143,[1]Inf_general_desarrollo!$A:$A,[1]Inf_general_desarrollo!$E:$E)","v":"Enyesado liso, piso cerámico, baños revestidos en azulejo, muebles de baño sencillos."},{"$f":"_xlfn.XLOOKUP($A143,[1]Inf_general_desarrollo!$A:$A,[1]Inf_general_desarrollo!$F:$F)","v":"Vistas de fachaleta tipo madera."},{"$f":"_xlfn.XLOOKUP($A143,[1]Inf_general_desarrollo!$A:$A,[1]Inf_general_desarrollo!$G:$G)","v":"Yeso pulido"},{"$f":"_xlfn.XLOOKUP($A143,[1]Inf_general_desarrollo!$A:$A,[1]Inf_general_desarrollo!$I:$I)","v":"Concreto Hidráulico"}]
["Villa Fontana","Horizontal","Dubai",null,3,3,1,2,96,128,6,"No",2,null,"Si","Si","Si","Instalaciones para boiler, gas, tinaco, lavadora.",{"$f":"_xlfn.XLOOKUP(Tabla62[[#This Row],[Nombre_desarrollo]],[1]Inf_general_desarrollo!$A:$A,[1]Inf_general_desarrollo!$C:$C)","v":"Cerámico"},{"$f":"_xlfn.XLOOKUP($A144,[1]Inf_general_desarrollo!$A:$A,[1]Inf_general_desarrollo!$D:$D)","v":"60x60"},{"$f":"_xlfn.XLOOKUP($A144,[1]Inf_general_desarrollo!$A:$A,[1]Inf_general_desarrollo!$E:$E)","v":"Enyesado liso, piso cerámico, baños revestidos en azulejo, muebles de baño sencillos."},{"$f":"_xlfn.XLOOKUP($A144,[1]Inf_general_desarrollo!$A:$A,[1]Inf_general_desarrollo!$F:$F)","v":"Vistas de fachaleta tipo madera."},{"$f":"_xlfn.XLOOKUP($A144,[1]Inf_general_desarrollo!$A:$A,[1]Inf_general_desarrollo!$G:$G)","v":"Yeso pulido"},{"$f":"_xlfn.XLOOKUP($A144,[1]Inf_general_desarrollo!$A:$A,[1]Inf_general_desarrollo!$I:$I)","v":"Concreto Hidráulico"}]
["Villa Fontana","Horizontal","Magna",null,2,2,1,2,96,"90.45",6,"No",2,null,"Si","Si","Si","Instalaciones para boiler, gas, tinaco, lavadora.",{"$f":"_xlfn.XLOOKUP(Tabla62[[#This Row],[Nombre_desarrollo]],[1]Inf_general_desarrollo!$A:$A,[1]Inf_general_desarrollo!$C:$C)","v":"Cerámico"},{"$f":"_xlfn.XLOOKUP($A145,[1]Inf_general_desarrollo!$A:$A,[1]Inf_general_desarrollo!$D:$D)","v":"60x60"},{"$f":"_xlfn.XLOOKUP($A145,[1]Inf_general_desarrollo!$A:$A,[1]Inf_general_desarrollo!$E:$E)","v":"Enyesado liso, piso cerámico, baños revestidos en azulejo, muebles de baño sencillos."},{"$f":"_xlfn.XLOOKUP($A145,[1]Inf_general_desarrollo!$A:$A,[1]Inf_general_desarrollo!$F:$F)","v":"Vistas de fachaleta tipo madera."},{"$f":"_xlfn.XLOOKUP($A145,[1]Inf_general_desarrollo!$A:$A,[1]Inf_general_desarrollo!$G:$G)","v":"Yeso pulido"},{"$f":"_xlfn.XLOOKUP($A145,[1]Inf_general_desarrollo!$A:$A,[1]Inf_general_desarrollo!$I:$I)","v":"Concreto Hidráulico"}]
["Villas de Montecassino- Etapa 1","Horizontal","Milan ",null,2,1,1,2,90,67.45,6.5,"Si",2,null,"Si","Si","Si","Instalaciones para boiler, lavadora, calentador de paso y minisplit",{"$f":"_xlfn.XLOOKUP(Tabla62[[#This Row],[Nombre_desarrollo]],[1]Inf_general_desarrollo!$A:$A,[1]Inf_general_desarrollo!$C:$C)","v":"Cerámico"},{"$f":"_xlfn.XLOOKUP($A146,[1]Inf_general_desarrollo!$A:$A,[1]Inf_general_desarrollo!$D:$D)","v":"60x60"},{"$f":"_xlfn.XLOOKUP($A146,[1]Inf_general_desarrollo!$A:$A,[1]Inf_general_desarrollo!$E:$E)","v":"Yeso pulido en predes, cocina de madera MDF y granito, pisos cerámicos."},{"$f":"_xlfn.XLOOKUP($A146,[1]Inf_general_desarrollo!$A:$A,[1]Inf_general_desarrollo!$F:$F)","v":"Vista en piedra tipo cantera."},{"$f":"_xlfn.XLOOKUP($A146,[1]Inf_general_desarrollo!$A:$A,[1]Inf_general_desarrollo!$G:$G)","v":"Yeso pulido"},{"$f":"_xlfn.XLOOKUP($A146,[1]Inf_general_desarrollo!$A:$A,[1]Inf_general_desarrollo!$I:$I)","v":"Concreto Hidráulico"}]
["Villas de Montecassino- Etapa 1","Horizontal","Napoles",null,3,2,0,2,90,79.48,6.5,"Si",2,null,"Si","Si","Si","Instalaciones para boiler, lavadora, calentador de paso y minisplit",{"$f":"_xlfn.XLOOKUP(Tabla62[[#This Row],[Nombre_desarrollo]],[1]Inf_general_desarrollo!$A:$A,[1]Inf_general_desarrollo!$C:$C)","v":"Cerámico"},{"$f":"_xlfn.XLOOKUP($A147,[1]Inf_general_desarrollo!$A:$A,[1]Inf_general_desarrollo!$D:$D)","v":"60x60"},{"$f":"_xlfn.XLOOKUP($A147,[1]Inf_general_desarrollo!$A:$A,[1]Inf_general_desarrollo!$E:$E)","v":"Yeso pulido en predes, cocina de madera MDF y granito, pisos cerámicos."},{"$f":"_xlfn.XLOOKUP($A147,[1]Inf_general_desarrollo!$A:$A,[1]Inf_general_desarrollo!$F:$F)","v":"Vista en piedra tipo cantera."},{"$f":"_xlfn.XLOOKUP($A147,[1]Inf_general_desarrollo!$A:$A,[1]Inf_general_desarrollo!$G:$G)","v":"Yeso pulido"},{"$f":"_xlfn.XLOOKUP($A147,[1]Inf_general_desarrollo!$A:$A,[1]Inf_general_desarrollo!$I:$I)","v":"Concreto Hidráulico"}]
["Villas de Montecassino- Etapa 1","Horizontal","Siena",null,3,3,0,2,102,98.67,6.5,"Si",2,null,"Si","Si","Si","Instalaciones para boiler, lavadora, calentador de paso y minisplit",{"$f":"_xlfn.XLOOKUP(Tabla62[[#This Row],[Nombre_desarrollo]],[1]Inf_general_desarrollo!$A:$A,[1]Inf_general_desarrollo!$C:$C)","v":"Cerámico"},{"$f":"_xlfn.XLOOKUP($A148,[1]Inf_general_desarrollo!$A:$A,[1]Inf_general_desarrollo!$D:$D)","v":"60x60"},{"$f":"_xlfn.XLOOKUP($A148,[1]Inf_general_desarrollo!$A:$A,[1]Inf_general_desarrollo!$E:$E)","v":"Yeso pulido en predes, cocina de madera MDF y granito, pisos cerámicos."},{"$f":"_xlfn.XLOOKUP($A148,[1]Inf_general_desarrollo!$A:$A,[1]Inf_general_desarrollo!$F:$F)","v":"Vista en piedra tipo cantera."},{"$f":"_xlfn.XLOOKUP($A148,[1]Inf_general_desarrollo!$A:$A,[1]Inf_general_desarrollo!$G:$G)","v":"Yeso pulido"},{"$f":"_xlfn.XLOOKUP($A148,[1]Inf_general_desarrollo!$A:$A,[1]Inf_general_desarrollo!$I:$I)","v":"Concreto Hidráulico"}]
["Villas de Montecassino- Etapa 2","Horizontal","Milan ",null,2,1,1,2,90,67.45,6.5,"Si",2,null,"Si","Si","Si","Instalaciones para boiler, lavadora, calentador de paso y minisplit",{"$f":"_xlfn.XLOOKUP(Tabla62[[#This Row],[Nombre_desarrollo]],[1]Inf_general_desarrollo!$A:$A,[1]Inf_general_desarrollo!$C:$C)","v":"Cerámico"},{"$f":"_xlfn.XLOOKUP($A149,[1]Inf_general_desarrollo!$A:$A,[1]Inf_general_desarrollo!$D:$D)","v":"60x60"},{"$f":"_xlfn.XLOOKUP($A149,[1]Inf_general_desarrollo!$A:$A,[1]Inf_general_desarrollo!$E:$E)","v":"Yeso pulido en predes, cocina de madera MDF y granito, pisos cerámicos."},{"$f":"_xlfn.XLOOKUP($A149,[1]Inf_general_desarrollo!$A:$A,[1]Inf_general_desarrollo!$F:$F)","v":"Vista en piedra tipo cantera."},{"$f":"_xlfn.XLOOKUP($A149,[1]Inf_general_desarrollo!$A:$A,[1]Inf_general_desarrollo!$G:$G)","v":"Yeso pulido"},{"$f":"_xlfn.XLOOKUP($A149,[1]Inf_general_desarrollo!$A:$A,[1]Inf_general_desarrollo!$I:$I)","v":"Concreto Hidráulico"}]
["Villas de Montecassino- Etapa 2","Horizontal","Napoles",null,3,2,0,2,90,79.48,6.5,"Si",2,null,"Si","Si","Si","Instalaciones para boiler, lavadora, calentador de paso y minisplit",{"$f":"_xlfn.XLOOKUP(Tabla62[[#This Row],[Nombre_desarrollo]],[1]Inf_general_desarrollo!$A:$A,[1]Inf_general_desarrollo!$C:$C)","v":"Cerámico"},{"$f":"_xlfn.XLOOKUP($A150,[1]Inf_general_desarrollo!$A:$A,[1]Inf_general_desarrollo!$D:$D)","v":"60x60"},{"$f":"_xlfn.XLOOKUP($A150,[1]Inf_general_desarrollo!$A:$A,[1]Inf_general_desarrollo!$E:$E)","v":"Yeso pulido en predes, cocina de madera MDF y granito, pisos cerámicos."},{"$f":"_xlfn.XLOOKUP($A150,[1]Inf_general_desarrollo!$A:$A,[1]Inf_general_desarrollo!$F:$F)","v":"Vista en piedra tipo cantera."},{"$f":"_xlfn.XLOOKUP($A150,[1]Inf_general_desarrollo!$A:$A,[1]Inf_general_desarrollo!$G:$G)","v":"Yeso pulido"},{"$f":"_xlfn.XLOOKUP($A150,[1]Inf_general_desarrollo!$A:$A,[1]Inf_general_desarrollo!$I:$I)","v":"Concreto Hidráulico"}]
["Villas de Montecassino- Etapa 2","Horizontal","Siena",null,3,3,0,2,102,98.67,6.5,"Si",2,null,"Si","Si","Si","Instalaciones para boiler, lavadora, calentador de paso y minisplit",{"$f":"_xlfn.XLOOKUP(Tabla62[[#This Row],[Nombre_desarrollo]],[1]Inf_general_desarrollo!$A:$A,[1]Inf_general_desarrollo!$C:$C)","v":"Cerámico"},{"$f":"_xlfn.XLOOKUP($A151,[1]Inf_general_desarrollo!$A:$A,[1]Inf_general_desarrollo!$D:$D)","v":"60x60"},{"$f":"_xlfn.XLOOKUP($A151,[1]Inf_general_desarrollo!$A:$A,[1]Inf_general_desarrollo!$E:$E)","v":"Yeso pulido en predes, cocina de madera MDF y granito, pisos cerámicos."},{"$f":"_xlfn.XLOOKUP($A151,[1]Inf_general_desarrollo!$A:$A,[1]Inf_general_desarrollo!$F:$F)","v":"Vista en piedra tipo cantera."},{"$f":"_xlfn.XLOOKUP($A151,[1]Inf_general_desarrollo!$A:$A,[1]Inf_general_desarrollo!$G:$G)","v":"Yeso pulido"},{"$f":"_xlfn.XLOOKUP($A151,[1]Inf_general_desarrollo!$A:$A,[1]Inf_general_desarrollo!$I:$I)","v":"Concreto Hidráulico"}]
["Viña Antigua","Horizontal","Borgoña",null,3,2,1,2,140,"137.44",7,"No",2,null,"Si","Si","Si","Boiler de paso e hidroneumatico.",{"$f":"_xlfn.XLOOKUP(Tabla62[[#This Row],[Nombre_desarrollo]],[1]Inf_general_desarrollo!$A:$A,[1]Inf_general_desarrollo!$C:$C)","v":"-"},{"$f":"_xlfn.XLOOKUP($A152,[1]Inf_general_desarrollo!$A:$A,[1]Inf_general_desarrollo!$D:$D)","v":"-"},{"$f":"_xlfn.XLOOKUP($A152,[1]Inf_general_desarrollo!$A:$A,[1]Inf_general_desarrollo!$E:$E)","v":"-"},{"$f":"_xlfn.XLOOKUP($A152,[1]Inf_general_desarrollo!$A:$A,[1]Inf_general_desarrollo!$F:$F)","v":"-"},{"$f":"_xlfn.XLOOKUP($A152,[1]Inf_general_desarrollo!$A:$A,[1]Inf_general_desarrollo!$G:$G)","v":"-"},{"$f":"_xlfn.XLOOKUP($A152,[1]Inf_general_desarrollo!$A:$A,[1]Inf_general_desarrollo!$I:$I)","v":"Concreto Hidráulico"}]
["Viña Antigua","Horizontal","Loira",null,3,3,1,2,180,204,9,"No",2,null,"Si","Si","Si","Boiler de paso e hidroneumatico.",{"$f":"_xlfn.XLOOKUP(Tabla62[[#This Row],[Nombre_desarrollo]],[1]Inf_general_desarrollo!$A:$A,[1]Inf_general_desarrollo!$C:$C)","v":"-"},{"$f":"_xlfn.XLOOKUP($A153,[1]Inf_general_desarrollo!$A:$A,[1]Inf_general_desarrollo!$D:$D)","v":"-"},{"$f":"_xlfn.XLOOKUP($A153,[1]Inf_general_desarrollo!$A:$A,[1]Inf_general_desarrollo!$E:$E)","v":"-"},{"$f":"_xlfn.XLOOKUP($A153,[1]Inf_general_desarrollo!$A:$A,[1]Inf_general_desarrollo!$F:$F)","v":"-"},{"$f":"_xlfn.XLOOKUP($A153,[1]Inf_general_desarrollo!$A:$A,[1]Inf_general_desarrollo!$G:$G)","v":"-"},{"$f":"_xlfn.XLOOKUP($A153,[1]Inf_general_desarrollo!$A:$A,[1]Inf_general_desarrollo!$I:$I)","v":"Concreto Hidráulico"}]
["Viña Real","Horizontal","Parma",null,3,2,1,2,109,"128.57",6,"No",2,null,"Si","Si","Si","Calentador, lavadora y preparación para minisplit.",{"$f":"_xlfn.XLOOKUP(Tabla62[[#This Row],[Nombre_desarrollo]],[1]Inf_general_desarrollo!$A:$A,[1]Inf_general_desarrollo!$C:$C)","v":"Cerámico"},{"$f":"_xlfn.XLOOKUP($A154,[1]Inf_general_desarrollo!$A:$A,[1]Inf_general_desarrollo!$D:$D)","v":"60x60"},{"$f":"_xlfn.XLOOKUP($A154,[1]Inf_general_desarrollo!$A:$A,[1]Inf_general_desarrollo!$E:$E)","v":"Yeso pulido, cocina con acabados en granito, herreria."},{"$f":"_xlfn.XLOOKUP($A154,[1]Inf_general_desarrollo!$A:$A,[1]Inf_general_desarrollo!$F:$F)","v":"Fachaleta tipo madera"},{"$f":"_xlfn.XLOOKUP($A154,[1]Inf_general_desarrollo!$A:$A,[1]Inf_general_desarrollo!$G:$G)","v":"Yeso pulido"},{"$f":"_xlfn.XLOOKUP($A154,[1]Inf_general_desarrollo!$A:$A,[1]Inf_general_desarrollo!$I:$I)","v":"Concreto hidráulico"}]
["Vivanta Residencial- Etapa 1","Horizontal","Tre",null,3,2,1,2,120,163,"2022-05-07","No",2,null,"Si","Si","Si","Instalaciones para lavadora, calentador de paso, boiler.",{"$f":"_xlfn.XLOOKUP(Tabla62[[#This Row],[Nombre_desarrollo]],[1]Inf_general_desarrollo!$A:$A,[1]Inf_general_desarrollo!$C:$C)","v":"Cerámico"},{"$f":"_xlfn.XLOOKUP($A155,[1]Inf_general_desarrollo!$A:$A,[1]Inf_general_desarrollo!$D:$D)","v":"60x60"},{"$f":"_xlfn.XLOOKUP($A155,[1]Inf_general_desarrollo!$A:$A,[1]Inf_general_desarrollo!$E:$E)","v":"Enyesado pulido, cocina de madera, granito pisos cerámicos."},{"$f":"_xlfn.XLOOKUP($A155,[1]Inf_general_desarrollo!$A:$A,[1]Inf_general_desarrollo!$F:$F)","v":"Vistas en piedra galarza y tipo madera."},{"$f":"_xlfn.XLOOKUP($A155,[1]Inf_general_desarrollo!$A:$A,[1]Inf_general_desarrollo!$G:$G)","v":"Yeso pulido"},{"$f":"_xlfn.XLOOKUP($A155,[1]Inf_general_desarrollo!$A:$A,[1]Inf_general_desarrollo!$I:$I)","v":"Concreto"}]
["Vivanta Residencial- Etapa 1","Horizontal","Tre Plus",null,3,2,1,2,120,165,"2022-05-07","No",2,null,"Si","Si","Si","Instalaciones para lavadora, calentador de paso, boiler.",{"$f":"_xlfn.XLOOKUP(Tabla62[[#This Row],[Nombre_desarrollo]],[1]Inf_general_desarrollo!$A:$A,[1]Inf_general_desarrollo!$C:$C)","v":"Cerámico"},{"$f":"_xlfn.XLOOKUP($A156,[1]Inf_general_desarrollo!$A:$A,[1]Inf_general_desarrollo!$D:$D)","v":"60x60"},{"$f":"_xlfn.XLOOKUP($A156,[1]Inf_general_desarrollo!$A:$A,[1]Inf_general_desarrollo!$E:$E)","v":"Enyesado pulido, cocina de madera, granito pisos cerámicos."},{"$f":"_xlfn.XLOOKUP($A156,[1]Inf_general_desarrollo!$A:$A,[1]Inf_general_desarrollo!$F:$F)","v":"Vistas en piedra galarza y tipo madera."},{"$f":"_xlfn.XLOOKUP($A156,[1]Inf_general_desarrollo!$A:$A,[1]Inf_general_desarrollo!$G:$G)","v":"Yeso pulido"},{"$f":"_xlfn.XLOOKUP($A156,[1]Inf_general_desarrollo!$A:$A,[1]Inf_general_desarrollo!$I:$I)","v":"Concreto"}]
["Vivanta Residencial- Etapa 1","Horizontal","Quattro",null,3,3,1,2,120,191,"2022-05-07","No",2,null,"Si","Si","Si","Instalaciones para lavadora, calentador de paso, boiler.",{"$f":"_xlfn.XLOOKUP(Tabla62[[#This Row],[Nombre_desarrollo]],[1]Inf_general_desarrollo!$A:$A,[1]Inf_general_desarrollo!$C:$C)","v":"Cerámico"},{"$f":"_xlfn.XLOOKUP($A157,[1]Inf_general_desarrollo!$A:$A,[1]Inf_general_desarrollo!$D:$D)","v":"60x60"},{"$f":"_xlfn.XLOOKUP($A157,[1]Inf_general_desarrollo!$A:$A,[1]Inf_general_desarrollo!$E:$E)","v":"Enyesado pulido, cocina de madera, granito pisos cerámicos."},{"$f":"_xlfn.XLOOKUP($A157,[1]Inf_general_desarrollo!$A:$A,[1]Inf_general_desarrollo!$F:$F)","v":"Vistas en piedra galarza y tipo madera."},{"$f":"_xlfn.XLOOKUP($A157,[1]Inf_general_desarrollo!$A:$A,[1]Inf_general_desarrollo!$G:$G)","v":"Yeso pulido"},{"$f":"_xlfn.XLOOKUP($A157,[1]Inf_general_desarrollo!$A:$A,[1]Inf_general_desarrollo!$I:$I)","v":"Concreto"}]
["Vivanta Residencial- Etapa 1","Horizontal","Cinque",null,3,4,0,2,120,202,"2022-05-07","No",2,null,"Si","Si","Si","Instalaciones para lavadora, calentador de paso, boiler.",{"$f":"_xlfn.XLOOKUP(Tabla62[[#This Row],[Nombre_desarrollo]],[1]Inf_general_desarrollo!$A:$A,[1]Inf_general_desarrollo!$C:$C)","v":"Cerámico"},{"$f":"_xlfn.XLOOKUP($A158,[1]Inf_general_desarrollo!$A:$A,[1]Inf_general_desarrollo!$D:$D)","v":"60x60"},{"$f":"_xlfn.XLOOKUP($A158,[1]Inf_general_desarrollo!$A:$A,[1]Inf_general_desarrollo!$E:$E)","v":"Enyesado pulido, cocina de madera, granito pisos cerámicos."},{"$f":"_xlfn.XLOOKUP($A158,[1]Inf_general_desarrollo!$A:$A,[1]Inf_general_desarrollo!$F:$F)","v":"Vistas en piedra galarza y tipo madera."},{"$f":"_xlfn.XLOOKUP($A158,[1]Inf_general_desarrollo!$A:$A,[1]Inf_general_desarrollo!$G:$G)","v":"Yeso pulido"},{"$f":"_xlfn.XLOOKUP($A158,[1]Inf_general_desarrollo!$A:$A,[1]Inf_general_desarrollo!$I:$I)","v":"Concreto"}]
["Vivanta Residencial- Etapa 1","Horizontal","Cinque Plus",null,3,4,1,2,120,250,"2022-05-07","No",2,null,"Si","Si","Si","Instalaciones para lavadora, calentador de paso, boiler.",{"$f":"_xlfn.XLOOKUP(Tabla62[[#This Row],[Nombre_desarrollo]],[1]Inf_general_desarrollo!$A:$A,[1]Inf_general_desarrollo!$C:$C)","v":"Cerámico"},{"$f":"_xlfn.XLOOKUP($A159,[1]Inf_general_desarrollo!$A:$A,[1]Inf_general_desarrollo!$D:$D)","v":"60x60"},{"$f":"_xlfn.XLOOKUP($A159,[1]Inf_general_desarrollo!$A:$A,[1]Inf_general_desarrollo!$E:$E)","v":"Enyesado pulido, cocina de madera, granito pisos cerámicos."},{"$f":"_xlfn.XLOOKUP($A159,[1]Inf_general_desarrollo!$A:$A,[1]Inf_general_desarrollo!$F:$F)","v":"Vistas en piedra galarza y tipo madera."},{"$f":"_xlfn.XLOOKUP($A159,[1]Inf_general_desarrollo!$A:$A,[1]Inf_general_desarrollo!$G:$G)","v":"Yeso pulido"},{"$f":"_xlfn.XLOOKUP($A159,[1]Inf_general_desarrollo!$A:$A,[1]Inf_general_desarrollo!$I:$I)","v":"Concreto"}]
["Vivanta Residencial- Etapa 2","Horizontal","Tre",null,3,2,1,2,120,163,"2022-05-07","No",2,null,"Si","Si","Si","Instalaciones para lavadora, calentador de paso, boiler.",{"$f":"_xlfn.XLOOKUP(Tabla62[[#This Row],[Nombre_desarrollo]],[1]Inf_general_desarrollo!$A:$A,[1]Inf_general_desarrollo!$C:$C)","v":"Cerámico"},{"$f":"_xlfn.XLOOKUP($A160,[1]Inf_general_desarrollo!$A:$A,[1]Inf_general_desarrollo!$D:$D)","v":"60x60"},{"$f":"_xlfn.XLOOKUP($A160,[1]Inf_general_desarrollo!$A:$A,[1]Inf_general_desarrollo!$E:$E)","v":"Enyesado pulido, cocina de madera, granito pisos cerámicos."},{"$f":"_xlfn.XLOOKUP($A160,[1]Inf_general_desarrollo!$A:$A,[1]Inf_general_desarrollo!$F:$F)","v":"Vistas en piedra galarza y tipo madera."},{"$f":"_xlfn.XLOOKUP($A160,[1]Inf_general_desarrollo!$A:$A,[1]Inf_general_desarrollo!$G:$G)","v":"Yeso pulido"},{"$f":"_xlfn.XLOOKUP($A160,[1]Inf_general_desarrollo!$A:$A,[1]Inf_general_desarrollo!$I:$I)","v":"Concreto"}]
["Vivanta Residencial- Etapa 2","Horizontal","Tre Plus",null,3,2,1,2,120,165,"2022-05-07","No",2,null,"Si","Si","Si","Instalaciones para lavadora, calentador de paso, boiler.",{"$f":"_xlfn.XLOOKUP(Tabla62[[#This Row],[Nombre_desarrollo]],[1]Inf_general_desarrollo!$A:$A,[1]Inf_general_desarrollo!$C:$C)","v":"Cerámico"},{"$f":"_xlfn.XLOOKUP($A161,[1]Inf_general_desarrollo!$A:$A,[1]Inf_general_desarrollo!$D:$D)","v":"60x60"},{"$f":"_xlfn.XLOOKUP($A161,[1]Inf_general_desarrollo!$A:$A,[1]Inf_general_desarrollo!$E:$E)","v":"Enyesado pulido, cocina de madera, granito pisos cerámicos."},{"$f":"_xlfn.XLOOKUP($A161,[1]Inf_general_desarrollo!$A:$A,[1]Inf_general_desarrollo!$F:$F)","v":"Vistas en piedra galarza y tipo madera."},{"$f":"_xlfn.XLOOKUP($A161,[1]Inf_general_desarrollo!$A:$A,[1]Inf_general_desarrollo!$G:$G)","v":"Yeso pulido"},{"$f":"_xlfn.XLOOKUP($A161,[1]Inf_general_desarrollo!$A:$A,[1]Inf_general_desarrollo!$I:$I)","v":"Concreto"}]
["Vivanta Residencial- Etapa 2","Horizontal","Quattro",null,3,3,1,2,120,191,"2022-05-07","No",2,null,"Si","Si","Si","Instalaciones para lavadora, calentador de paso, boiler.",{"$f":"_xlfn.XLOOKUP(Tabla62[[#This Row],[Nombre_desarrollo]],[1]Inf_general_desarrollo!$A:$A,[1]Inf_general_desarrollo!$C:$C)","v":"Cerámico"},{"$f":"_xlfn.XLOOKUP($A162,[1]Inf_general_desarrollo!$A:$A,[1]Inf_general_desarrollo!$D:$D)","v":"60x60"},{"$f":"_xlfn.XLOOKUP($A162,[1]Inf_general_desarrollo!$A:$A,[1]Inf_general_desarrollo!$E:$E)","v":"Enyesado pulido, cocina de madera, granito pisos cerámicos."},{"$f":"_xlfn.XLOOKUP($A162,[1]Inf_general_desarrollo!$A:$A,[1]Inf_general_desarrollo!$F:$F)","v":"Vistas en piedra galarza y tipo madera."},{"$f":"_xlfn.XLOOKUP($A162,[1]Inf_general_desarrollo!$A:$A,[1]Inf_general_desarrollo!$G:$G)","v":"Yeso pulido"},{"$f":"_xlfn.XLOOKUP($A162,[1]Inf_general_desarrollo!$A:$A,[1]Inf_general_desarrollo!$I:$I)","v":"Concreto"}]
["Vivanta Residencial- Etapa 2","Horizontal","Cinque",null,3,4,0,2,120,202,"2022-05-07","No",2,null,"Si","Si","Si","Instalaciones para lavadora, calentador de paso, boiler.",{"$f":"_xlfn.XLOOKUP(Tabla62[[#This Row],[Nombre_desarrollo]],[1]Inf_general_desarrollo!$A:$A,[1]Inf_general_desarrollo!$C:$C)","v":"Cerámico"},{"$f":"_xlfn.XLOOKUP($A163,[1]Inf_general_desarrollo!$A:$A,[1]Inf_general_desarrollo!$D:$D)","v":"60x60"},{"$f":"_xlfn.XLOOKUP($A163,[1]Inf_general_desarrollo!$A:$A,[1]Inf_general_desarrollo!$E:$E)","v":"Enyesado pulido, cocina de madera, granito pisos cerámicos."},{"$f":"_xlfn.XLOOKUP($A163,[1]Inf_general_desarrollo!$A:$A,[1]Inf_general_desarrollo!$F:$F)","v":"Vistas en piedra galarza y tipo madera."},{"$f":"_xlfn.XLOOKUP($A163,[1]Inf_general_desarrollo!$A:$A,[1]Inf_general_desarrollo!$G:$G)","v":"Yeso pulido"},{"$f":"_xlfn.XLOOKUP($A163,[1]Inf_general_desarrollo!$A:$A,[1]Inf_general_desarrollo!$I:$I)","v":"Concreto"}]
["Vivanta Residencial- Etapa 2","Horizontal","Cinque Plus",null,3,4,1,2,120,250,"2022-05-07","No",2,null,"Si","Si","Si","Instalaciones para lavadora, calentador de paso, boiler.",{"$f":"_xlfn.XLOOKUP(Tabla62[[#This Row],[Nombre_desarrollo]],[1]Inf_general_desarrollo!$A:$A,[1]Inf_general_desarrollo!$C:$C)","v":"Cerámico"},{"$f":"_xlfn.XLOOKUP($A164,[1]Inf_general_desarrollo!$A:$A,[1]Inf_general_desarrollo!$D:$D)","v":"60x60"},{"$f":"_xlfn.XLOOKUP($A164,[1]Inf_general_desarrollo!$A:$A,[1]Inf_general_desarrollo!$E:$E)","v":"Enyesado pulido, cocina de madera, granito pisos cerámicos."},{"$f":"_xlfn.XLOOKUP($A164,[1]Inf_general_desarrollo!$A:$A,[1]Inf_general_desarrollo!$F:$F)","v":"Vistas en piedra galarza y tipo madera."},{"$f":"_xlfn.XLOOKUP($A164,[1]Inf_general_desarrollo!$A:$A,[1]Inf_general_desarrollo!$G:$G)","v":"Yeso pulido"},{"$f":"_xlfn.XLOOKUP($A164,[1]Inf_general_desarrollo!$A:$A,[1]Inf_general_desarrollo!$I:$I)","v":"Concreto"}]
["Vivanta Residencial- Etapa 2","Horizontal","Due",null,3,4,1,2,120,131,"2023-05-07","No",2,null,"Si","Si","Si","Instalaciones para lavadora, calentador de paso, boiler.",{"$f":"_xlfn.XLOOKUP(Tabla62[[#This Row],[Nombre_desarrollo]],[1]Inf_general_desarrollo!$A:$A,[1]Inf_general_desarrollo!$C:$C)","v":"Cerámico"},{"$f":"_xlfn.XLOOKUP($A165,[1]Inf_general_desarrollo!$A:$A,[1]Inf_general_desarrollo!$D:$D)","v":"60x60"},{"$f":"_xlfn.XLOOKUP($A165,[1]Inf_general_desarrollo!$A:$A,[1]Inf_general_desarrollo!$E:$E)","v":"Enyesado pulido, cocina de madera, granito pisos cerámicos."},{"$f":"_xlfn.XLOOKUP($A165,[1]Inf_general_desarrollo!$A:$A,[1]Inf_general_desarrollo!$F:$F)","v":"Vistas en piedra galarza y tipo madera."},{"$f":"_xlfn.XLOOKUP($A165,[1]Inf_general_desarrollo!$A:$A,[1]Inf_general_desarrollo!$G:$G)","v":"Yeso pulido"},{"$f":"_xlfn.XLOOKUP($A165,[1]Inf_general_desarrollo!$A:$A,[1]Inf_general_desarrollo!$I:$I)","v":"Concreto"}]
["Xaramá Casas","Horizontal","Arzola",null,2,2,0,1,160,110,8,"No",2,null,"Si","Si","Si","Preparación para minisplit, gas natural, lavadora.",{"$f":"_xlfn.XLOOKUP(Tabla62[[#This Row],[Nombre_desarrollo]],[1]Inf_general_desarrollo!$A:$A,[1]Inf_general_desarrollo!$C:$C)","v":"Cerámico"},{"$f":"_xlfn.XLOOKUP($A166,[1]Inf_general_desarrollo!$A:$A,[1]Inf_general_desarrollo!$D:$D)","v":"60x60"},{"$f":"_xlfn.XLOOKUP($A166,[1]Inf_general_desarrollo!$A:$A,[1]Inf_general_desarrollo!$E:$E)","v":"Paredes en yeso pulido, piso cerámico, cocina con acabados en granito, regaderas revestidas con azulejo."},{"$f":"_xlfn.XLOOKUP($A166,[1]Inf_general_desarrollo!$A:$A,[1]Inf_general_desarrollo!$F:$F)","v":"Vistas ceramicas tipo madera y herreria."},{"$f":"_xlfn.XLOOKUP($A166,[1]Inf_general_desarrollo!$A:$A,[1]Inf_general_desarrollo!$G:$G)","v":"Yeso pulido"},{"$f":"_xlfn.XLOOKUP($A166,[1]Inf_general_desarrollo!$A:$A,[1]Inf_general_desarrollo!$I:$I)","v":"Concreto"}]
["Xaramá Casas","Horizontal","Girona",null,3,3,0,2,160,154,8,"No",2,null,"Si","Si","Si","Preparación para minisplit, gas natural, lavadora.",{"$f":"_xlfn.XLOOKUP(Tabla62[[#This Row],[Nombre_desarrollo]],[1]Inf_general_desarrollo!$A:$A,[1]Inf_general_desarrollo!$C:$C)","v":"Cerámico"},{"$f":"_xlfn.XLOOKUP($A167,[1]Inf_general_desarrollo!$A:$A,[1]Inf_general_desarrollo!$D:$D)","v":"60x60"},{"$f":"_xlfn.XLOOKUP($A167,[1]Inf_general_desarrollo!$A:$A,[1]Inf_general_desarrollo!$E:$E)","v":"Paredes en yeso pulido, piso cerámico, cocina con acabados en granito, regaderas revestidas con azulejo."},{"$f":"_xlfn.XLOOKUP($A167,[1]Inf_general_desarrollo!$A:$A,[1]Inf_general_desarrollo!$F:$F)","v":"Vistas ceramicas tipo madera y herreria."},{"$f":"_xlfn.XLOOKUP($A167,[1]Inf_general_desarrollo!$A:$A,[1]Inf_general_desarrollo!$G:$G)","v":"Yeso pulido"},{"$f":"_xlfn.XLOOKUP($A167,[1]Inf_general_desarrollo!$A:$A,[1]Inf_general_desarrollo!$I:$I)","v":"Concreto"}]
["Xaramá Casas","Horizontal","Caltengo",null,3,3,0,2,160,166,8,"No",2,null,"Si","Si","Si","Preparación para minisplit, gas natural, lavadora.",{"$f":"_xlfn.XLOOKUP(Tabla62[[#This Row],[Nombre_desarrollo]],[1]Inf_general_desarrollo!$A:$A,[1]Inf_general_desarrollo!$C:$C)","v":"Cerámico"},{"$f":"_xlfn.XLOOKUP($A168,[1]Inf_general_desarrollo!$A:$A,[1]Inf_general_desarrollo!$D:$D)","v":"60x60"},{"$f":"_xlfn.XLOOKUP($A168,[1]Inf_general_desarrollo!$A:$A,[1]Inf_general_desarrollo!$E:$E)","v":"Paredes en yeso pulido, piso cerámico, cocina con acabados en granito, regaderas revestidas con azulejo."},{"$f":"_xlfn.XLOOKUP($A168,[1]Inf_general_desarrollo!$A:$A,[1]Inf_general_desarrollo!$F:$F)","v":"Vistas ceramicas tipo madera y herreria."},{"$f":"_xlfn.XLOOKUP($A168,[1]Inf_general_desarrollo!$A:$A,[1]Inf_general_desarrollo!$G:$G)","v":"Yeso pulido"},{"$f":"_xlfn.XLOOKUP($A168,[1]Inf_general_desarrollo!$A:$A,[1]Inf_general_desarrollo!$I:$I)","v":"Concreto"}]
["Xaramá Casas","Horizontal","Argovia",null,3,3,0,2,160,172,8,"No",2,null,"Si","Si","Si","Preparación para minisplit, gas natural, lavadora.",{"$f":"_xlfn.XLOOKUP(Tabla62[[#This Row],[Nombre_desarrollo]],[1]Inf_general_desarrollo!$A:$A,[1]Inf_general_desarrollo!$C:$C)","v":"Cerámico"},{"$f":"_xlfn.XLOOKUP($A169,[1]Inf_general_desarrollo!$A:$A,[1]Inf_general_desarrollo!$D:$D)","v":"60x60"},{"$f":"_xlfn.XLOOKUP($A169,[1]Inf_general_desarrollo!$A:$A,[1]Inf_general_desarrollo!$E:$E)","v":"Paredes en yeso pulido, piso cerámico, cocina con acabados en granito, regaderas revestidas con azulejo."},{"$f":"_xlfn.XLOOKUP($A169,[1]Inf_general_desarrollo!$A:$A,[1]Inf_general_desarrollo!$F:$F)","v":"Vistas ceramicas tipo madera y herreria."},{"$f":"_xlfn.XLOOKUP($A169,[1]Inf_general_desarrollo!$A:$A,[1]Inf_general_desarrollo!$G:$G)","v":"Yeso pulido"},{"$f":"_xlfn.XLOOKUP($A169,[1]Inf_general_desarrollo!$A:$A,[1]Inf_general_desarrollo!$I:$I)","v":"Concreto"}]
["Xaramá Casas","Horizontal","Tabi",null,3,3,0,2,160,171,8,"No",2,null,"Si","Si","Si","Preparación para minisplit, gas natural, lavadora.",{"$f":"_xlfn.XLOOKUP(Tabla62[[#This Row],[Nombre_desarrollo]],[1]Inf_general_desarrollo!$A:$A,[1]Inf_general_desarrollo!$C:$C)","v":"Cerámico"},{"$f":"_xlfn.XLOOKUP($A170,[1]Inf_general_desarrollo!$A:$A,[1]Inf_general_desarrollo!$D:$D)","v":"60x60"},{"$f":"_xlfn.XLOOKUP($A170,[1]Inf_general_desarrollo!$A:$A,[1]Inf_general_desarrollo!$E:$E)","v":"Paredes en yeso pulido, piso cerámico, cocina con acabados en granito, regaderas revestidas con azulejo."},{"$f":"_xlfn.XLOOKUP($A170,[1]Inf_general_desarrollo!$A:$A,[1]Inf_general_desarrollo!$F:$F)","v":"Vistas ceramicas tipo madera y herreria."},{"$f":"_xlfn.XLOOKUP($A170,[1]Inf_general_desarrollo!$A:$A,[1]Inf_general_desarrollo!$G:$G)","v":"Yeso pulido"},{"$f":"_xlfn.XLOOKUP($A170,[1]Inf_general_desarrollo!$A:$A,[1]Inf_general_desarrollo!$I:$I)","v":"Concreto"}]
["Ziba Casas","Horizontal","Bimba",null,3,2,2,2,120,154,6,"No",2,null,"Si","Si","Si","Instalación para gas natural y minisplit.",{"$f":"_xlfn.XLOOKUP(Tabla62[[#This Row],[Nombre_desarrollo]],[1]Inf_general_desarrollo!$A:$A,[1]Inf_general_desarrollo!$C:$C)","v":"Cerámico"},{"$f":"_xlfn.XLOOKUP($A171,[1]Inf_general_desarrollo!$A:$A,[1]Inf_general_desarrollo!$D:$D)","v":"60x60"},{"$f":"_xlfn.XLOOKUP($A171,[1]Inf_general_desarrollo!$A:$A,[1]Inf_general_desarrollo!$E:$E)","v":"Yeso pulido, pintura blanca, cocina con acabados de granito."},{"$f":"_xlfn.XLOOKUP($A171,[1]Inf_general_desarrollo!$A:$A,[1]Inf_general_desarrollo!$F:$F)","v":"Cantera y herreria"},{"$f":"_xlfn.XLOOKUP($A171,[1]Inf_general_desarrollo!$A:$A,[1]Inf_general_desarrollo!$G:$G)","v":"Yeso pulido"},{"$f":"_xlfn.XLOOKUP($A171,[1]Inf_general_desarrollo!$A:$A,[1]Inf_general_desarrollo!$I:$I)","v":"Concreto Hidráulico"}]
["Ziba Casas","Horizontal","Donna",null,3,2,1,2,120,126,6,"No",2,null,"Si","Si","Si","Instalación para gas natural y minisplit.",{"$f":"_xlfn.XLOOKUP(Tabla62[[#This Row],[Nombre_desarrollo]],[1]Inf_general_desarrollo!$A:$A,[1]Inf_general_desarrollo!$C:$C)","v":"Cerámico"},{"$f":"_xlfn.XLOOKUP($A172,[1]Inf_general_desarrollo!$A:$A,[1]Inf_general_desarrollo!$D:$D)","v":"60x60"},{"$f":"_xlfn.XLOOKUP($A172,[1]Inf_general_desarrollo!$A:$A,[1]Inf_general_desarrollo!$E:$E)","v":"Yeso pulido, pintura blanca, cocina con acabados de granito."},{"$f":"_xlfn.XLOOKUP($A172,[1]Inf_general_desarrollo!$A:$A,[1]Inf_general_desarrollo!$F:$F)","v":"Cantera y herreria"},{"$f":"_xlfn.XLOOKUP($A172,[1]Inf_general_desarrollo!$A:$A,[1]Inf_general_desarrollo!$G:$G)","v":"Yeso pulido"},{"$f":"_xlfn.XLOOKUP($A172,[1]Inf_general_desarrollo!$A:$A,[1]Inf_general_desarrollo!$I:$I)","v":"Concreto Hidráulico"}]
["Ebano - Carmel Residencial","Horizontal","Abeto",null,2,2,1,2,164,146,9,"No",2,null,"Si","Si","Si","Instalación para lavadora, secadora,calemtador de paso, minisplit.",{"$f":"_xlfn.XLOOKUP(Tabla62[[#This Row],[Nombre_desarrollo]],[1]Inf_general_desarrollo!$A:$A,[1]Inf_general_desarrollo!$C:$C)","v":"ceramico"},{"$f":"_xlfn.XLOOKUP($A173,[1]Inf_general_desarrollo!$A:$A,[1]Inf_general_desarrollo!$D:$D)","v":"55x55"},{"$f":"_xlfn.XLOOKUP($A173,[1]Inf_general_desarrollo!$A:$A,[1]Inf_general_desarrollo!$E:$E)","v":"Paredes en yeso pulido,cocina con acabados en granito y madera, baños con base de lavabo en mármol."},{"$f":"_xlfn.XLOOKUP($A173,[1]Inf_general_desarrollo!$A:$A,[1]Inf_general_desarrollo!$F:$F)","v":"Acabados exteriores con vistas de fachaleta de cantera."},{"$f":"_xlfn.XLOOKUP($A173,[1]Inf_general_desarrollo!$A:$A,[1]Inf_general_desarrollo!$G:$G)","v":"Yeso pulido"},{"$f":"_xlfn.XLOOKUP($A173,[1]Inf_general_desarrollo!$A:$A,[1]Inf_general_desarrollo!$I:$I)","v":"Concreto Hidráulico"}]
["Ebano - Carmel Residencial","Horizontal","Ebano",null,3,2,1,2,164,156,9,"No",2,null,"Si","Si","Si","Instalación para lavadora, secadora, calentador de paso, minisplit.",{"$f":"_xlfn.XLOOKUP(Tabla62[[#This Row],[Nombre_desarrollo]],[1]Inf_general_desarrollo!$A:$A,[1]Inf_general_desarrollo!$C:$C)","v":"ceramico"},{"$f":"_xlfn.XLOOKUP($A174,[1]Inf_general_desarrollo!$A:$A,[1]Inf_general_desarrollo!$D:$D)","v":"55x55"},{"$f":"_xlfn.XLOOKUP($A174,[1]Inf_general_desarrollo!$A:$A,[1]Inf_general_desarrollo!$E:$E)","v":"Paredes en yeso pulido,cocina con acabados en granito y madera, baños con base de lavabo en mármol."},{"$f":"_xlfn.XLOOKUP($A174,[1]Inf_general_desarrollo!$A:$A,[1]Inf_general_desarrollo!$F:$F)","v":"Acabados exteriores con vistas de fachaleta de cantera."},{"$f":"_xlfn.XLOOKUP($A174,[1]Inf_general_desarrollo!$A:$A,[1]Inf_general_desarrollo!$G:$G)","v":"Yeso pulido"},{"$f":"_xlfn.XLOOKUP($A174,[1]Inf_general_desarrollo!$A:$A,[1]Inf_general_desarrollo!$I:$I)","v":"Concreto Hidráulico"}]
["Ebano - Carmel Residencial","Horizontal","Roble",null,3,2,1,2,164,160,9,"No",2,null,"Si","Si","Si","Instalación para lavadora, secadora,calemtador de paso, minisplit.",{"$f":"_xlfn.XLOOKUP(Tabla62[[#This Row],[Nombre_desarrollo]],[1]Inf_general_desarrollo!$A:$A,[1]Inf_general_desarrollo!$C:$C)","v":"ceramico"},{"$f":"_xlfn.XLOOKUP($A175,[1]Inf_general_desarrollo!$A:$A,[1]Inf_general_desarrollo!$D:$D)","v":"55x55"},{"$f":"_xlfn.XLOOKUP($A175,[1]Inf_general_desarrollo!$A:$A,[1]Inf_general_desarrollo!$E:$E)","v":"Paredes en yeso pulido,cocina con acabados en granito y madera, baños con base de lavabo en mármol."},{"$f":"_xlfn.XLOOKUP($A175,[1]Inf_general_desarrollo!$A:$A,[1]Inf_general_desarrollo!$F:$F)","v":"Acabados exteriores con vistas de fachaleta de cantera."},{"$f":"_xlfn.XLOOKUP($A175,[1]Inf_general_desarrollo!$A:$A,[1]Inf_general_desarrollo!$G:$G)","v":"Yeso pulido"},{"$f":"_xlfn.XLOOKUP($A175,[1]Inf_general_desarrollo!$A:$A,[1]Inf_general_desarrollo!$I:$I)","v":"Concreto Hidráulico"}]
["Ebano - Carmel Residencial","Horizontal","Ahuehuete",null,3,3,0,2,164,180,9,"No",2,null,"Si","Si","Si","Instalación para lavadora, secadora, calentador de paso, minisplit.",{"$f":"_xlfn.XLOOKUP(Tabla62[[#This Row],[Nombre_desarrollo]],[1]Inf_general_desarrollo!$A:$A,[1]Inf_general_desarrollo!$C:$C)","v":"ceramico"},{"$f":"_xlfn.XLOOKUP($A176,[1]Inf_general_desarrollo!$A:$A,[1]Inf_general_desarrollo!$D:$D)","v":"55x55"},{"$f":"_xlfn.XLOOKUP($A176,[1]Inf_general_desarrollo!$A:$A,[1]Inf_general_desarrollo!$E:$E)","v":"Paredes en yeso pulido,cocina con acabados en granito y madera, baños con base de lavabo en mármol."},{"$f":"_xlfn.XLOOKUP($A176,[1]Inf_general_desarrollo!$A:$A,[1]Inf_general_desarrollo!$F:$F)","v":"Acabados exteriores con vistas de fachaleta de cantera."},{"$f":"_xlfn.XLOOKUP($A176,[1]Inf_general_desarrollo!$A:$A,[1]Inf_general_desarrollo!$G:$G)","v":"Yeso pulido"},{"$f":"_xlfn.XLOOKUP($A176,[1]Inf_general_desarrollo!$A:$A,[1]Inf_general_desarrollo!$I:$I)","v":"Concreto Hidráulico"}]
["Lucerna Residencial - Frankfurt","Horizontal","Danubio",null,3,2,1,2,105,"135.58",6,"No",2,null,"Si","Si","Si","Instalaciones de gas, lavadora y boiler.",{"$f":"_xlfn.XLOOKUP(Tabla62[[#This Row],[Nombre_desarrollo]],[1]Inf_general_desarrollo!$A:$A,[1]Inf_general_desarrollo!$C:$C)","v":"Cerámico"},{"$f":"_xlfn.XLOOKUP($A177,[1]Inf_general_desarrollo!$A:$A,[1]Inf_general_desarrollo!$D:$D)","v":"60x60"},{"$f":"_xlfn.XLOOKUP($A177,[1]Inf_general_desarrollo!$A:$A,[1]Inf_general_desarrollo!$E:$E)","v":"Texturizado en paredes, closet de madera, accesorios de baño sencillos."},{"$f":"_xlfn.XLOOKUP($A177,[1]Inf_general_desarrollo!$A:$A,[1]Inf_general_desarrollo!$F:$F)","v":"Yeso pulido en exterior y vistas en piedra galarza"},{"$f":"_xlfn.XLOOKUP($A177,[1]Inf_general_desarrollo!$A:$A,[1]Inf_general_desarrollo!$G:$G)","v":"Texturizada"},{"$f":"_xlfn.XLOOKUP($A177,[1]Inf_general_desarrollo!$A:$A,[1]Inf_general_desarrollo!$I:$I)","v":"Concreto"}]
["Lucerna Residencial - Frankfurt","Horizontal","Zurich",null,3,2,1,2,105,"118.6",6,"No",2,null,"Si","Si","Si","Instalaciones de gas, lavadora y boiler.",{"$f":"_xlfn.XLOOKUP(Tabla62[[#This Row],[Nombre_desarrollo]],[1]Inf_general_desarrollo!$A:$A,[1]Inf_general_desarrollo!$C:$C)","v":"Cerámico"},{"$f":"_xlfn.XLOOKUP($A178,[1]Inf_general_desarrollo!$A:$A,[1]Inf_general_desarrollo!$D:$D)","v":"60x60"},{"$f":"_xlfn.XLOOKUP($A178,[1]Inf_general_desarrollo!$A:$A,[1]Inf_general_desarrollo!$E:$E)","v":"Texturizado en paredes, closet de madera, accesorios de baño sencillos."},{"$f":"_xlfn.XLOOKUP($A178,[1]Inf_general_desarrollo!$A:$A,[1]Inf_general_desarrollo!$F:$F)","v":"Yeso pulido en exterior y vistas en piedra galarza"},{"$f":"_xlfn.XLOOKUP($A178,[1]Inf_general_desarrollo!$A:$A,[1]Inf_general_desarrollo!$G:$G)","v":"Texturizada"},{"$f":"_xlfn.XLOOKUP($A178,[1]Inf_general_desarrollo!$A:$A,[1]Inf_general_desarrollo!$I:$I)","v":"Concreto"}]
["Lucerna Residencial - Frankfurt","Horizontal","Ginebra",null,3,2,1,2,105,"122.58",6,"No",2,null,"Si","Si","Si","Instalaciones de gas, lavadora y boiler.",{"$f":"_xlfn.XLOOKUP(Tabla62[[#This Row],[Nombre_desarrollo]],[1]Inf_general_desarrollo!$A:$A,[1]Inf_general_desarrollo!$C:$C)","v":"Cerámico"},{"$f":"_xlfn.XLOOKUP($A179,[1]Inf_general_desarrollo!$A:$A,[1]Inf_general_desarrollo!$D:$D)","v":"60x60"},{"$f":"_xlfn.XLOOKUP($A179,[1]Inf_general_desarrollo!$A:$A,[1]Inf_general_desarrollo!$E:$E)","v":"Texturizado en paredes, closet de madera, accesorios de baño sencillos."},{"$f":"_xlfn.XLOOKUP($A179,[1]Inf_general_desarrollo!$A:$A,[1]Inf_general_desarrollo!$F:$F)","v":"Yeso pulido en exterior y vistas en piedra galarza"},{"$f":"_xlfn.XLOOKUP($A179,[1]Inf_general_desarrollo!$A:$A,[1]Inf_general_desarrollo!$G:$G)","v":"Texturizada"},{"$f":"_xlfn.XLOOKUP($A179,[1]Inf_general_desarrollo!$A:$A,[1]Inf_general_desarrollo!$I:$I)","v":"Concreto"}]
["Reserva Santa Monica Priv CEREZOS","Horizontal","Prunus",null,3,3,1,2,160,171,8,"No",2,null,"Si","Si","Si","Instalaciones para boiler, gas, tinaco, lavadora, minisplit.",{"$f":"_xlfn.XLOOKUP(Tabla62[[#This Row],[Nombre_desarrollo]],[1]Inf_general_desarrollo!$A:$A,[1]Inf_general_desarrollo!$C:$C)","v":"Cerámico"},{"$f":"_xlfn.XLOOKUP($A180,[1]Inf_general_desarrollo!$A:$A,[1]Inf_general_desarrollo!$D:$D)","v":"60x60"},{"$f":"_xlfn.XLOOKUP($A180,[1]Inf_general_desarrollo!$A:$A,[1]Inf_general_desarrollo!$E:$E)","v":"yeso pulido, cocina de madera y granito, pisos cerámicos."},{"$f":"_xlfn.XLOOKUP($A180,[1]Inf_general_desarrollo!$A:$A,[1]Inf_general_desarrollo!$F:$F)","v":"Muros con detalles de piedra y madera, tejas en techo"},{"$f":"_xlfn.XLOOKUP($A180,[1]Inf_general_desarrollo!$A:$A,[1]Inf_general_desarrollo!$G:$G)","v":"Yeso pulido"},{"$f":"_xlfn.XLOOKUP($A180,[1]Inf_general_desarrollo!$A:$A,[1]Inf_general_desarrollo!$I:$I)","v":"Concreto"}]
["Reserva Santa Monica Priv CEREZOS","Horizontal","Santina",null,3,3,1,2,160,179,8,"Si",2,null,"Si","Si","Si","Instalaciones para boiler, gas, tinaco, lavadora, minisplit.",{"$f":"_xlfn.XLOOKUP(Tabla62[[#This Row],[Nombre_desarrollo]],[1]Inf_general_desarrollo!$A:$A,[1]Inf_general_desarrollo!$C:$C)","v":"Cerámico"},{"$f":"_xlfn.XLOOKUP($A181,[1]Inf_general_desarrollo!$A:$A,[1]Inf_general_desarrollo!$D:$D)","v":"60x60"},{"$f":"_xlfn.XLOOKUP($A181,[1]Inf_general_desarrollo!$A:$A,[1]Inf_general_desarrollo!$E:$E)","v":"yeso pulido, cocina de madera y granito, pisos cerámicos."},{"$f":"_xlfn.XLOOKUP($A181,[1]Inf_general_desarrollo!$A:$A,[1]Inf_general_desarrollo!$F:$F)","v":"Muros con detalles de piedra y madera, tejas en techo"},{"$f":"_xlfn.XLOOKUP($A181,[1]Inf_general_desarrollo!$A:$A,[1]Inf_general_desarrollo!$G:$G)","v":"Yeso pulido"},{"$f":"_xlfn.XLOOKUP($A181,[1]Inf_general_desarrollo!$A:$A,[1]Inf_general_desarrollo!$I:$I)","v":"Concreto"}]
["Reserva Santa Monica Priv NOGALES","Horizontal","Durham",null,3,3,1,2,200,"188.64",10,"Si",2,null,"Si","Si","Si","Instalaciones para boiler, gas, tinaco, lavadora, minisplit.",{"$f":"_xlfn.XLOOKUP(Tabla62[[#This Row],[Nombre_desarrollo]],[1]Inf_general_desarrollo!$A:$A,[1]Inf_general_desarrollo!$C:$C)","v":"Cerámico"},{"$f":"_xlfn.XLOOKUP($A182,[1]Inf_general_desarrollo!$A:$A,[1]Inf_general_desarrollo!$D:$D)","v":"60x60"},{"$f":"_xlfn.XLOOKUP($A182,[1]Inf_general_desarrollo!$A:$A,[1]Inf_general_desarrollo!$E:$E)","v":"yeso pulido, cocina de madera y granito, pisos cerámicos."},{"$f":"_xlfn.XLOOKUP($A182,[1]Inf_general_desarrollo!$A:$A,[1]Inf_general_desarrollo!$F:$F)","v":"Muros con detalles de piedra y madera, tejas en techo"},{"$f":"_xlfn.XLOOKUP($A182,[1]Inf_general_desarrollo!$A:$A,[1]Inf_general_desarrollo!$G:$G)","v":"Yeso pulido"},{"$f":"_xlfn.XLOOKUP($A182,[1]Inf_general_desarrollo!$A:$A,[1]Inf_general_desarrollo!$I:$I)","v":"Concreto"}]
["Reserva Santa Monica Priv NOGALES","Horizontal","Fernom",null,4,3,0,2,200,"168.97",10,"No",2,null,"Si","Si","Si","Instalaciones para boiler, gas, tinaco, lavadora, minisplit.",{"$f":"_xlfn.XLOOKUP(Tabla62[[#This Row],[Nombre_desarrollo]],[1]Inf_general_desarrollo!$A:$A,[1]Inf_general_desarrollo!$C:$C)","v":"Cerámico"},{"$f":"_xlfn.XLOOKUP($A183,[1]Inf_general_desarrollo!$A:$A,[1]Inf_general_desarrollo!$D:$D)","v":"60x60"},{"$f":"_xlfn.XLOOKUP($A183,[1]Inf_general_desarrollo!$A:$A,[1]Inf_general_desarrollo!$E:$E)","v":"yeso pulido, cocina de madera y granito, pisos cerámicos."},{"$f":"_xlfn.XLOOKUP($A183,[1]Inf_general_desarrollo!$A:$A,[1]Inf_general_desarrollo!$F:$F)","v":"Muros con detalles de piedra y madera, tejas en techo"},{"$f":"_xlfn.XLOOKUP($A183,[1]Inf_general_desarrollo!$A:$A,[1]Inf_general_desarrollo!$G:$G)","v":"Yeso pulido"},{"$f":"_xlfn.XLOOKUP($A183,[1]Inf_general_desarrollo!$A:$A,[1]Inf_general_desarrollo!$I:$I)","v":"Concreto"}]
["Ronda Residencial - Reserva san Matias","Horizontal","Marbella",null,3,3,1,2,"115.5","151.92",7,"No",2,null,"Si","Si","Si","Calentador de paso",{"$f":"_xlfn.XLOOKUP(Tabla62[[#This Row],[Nombre_desarrollo]],[1]Inf_general_desarrollo!$A:$A,[1]Inf_general_desarrollo!$C:$C)","v":"Cerámico"},{"$f":"_xlfn.XLOOKUP($A184,[1]Inf_general_desarrollo!$A:$A,[1]Inf_general_desarrollo!$D:$D)","v":"60x60"},{"$f":"_xlfn.XLOOKUP($A184,[1]Inf_general_desarrollo!$A:$A,[1]Inf_general_desarrollo!$E:$E)","v":"Accesorios de baño, paredes en yeso."},{"$f":"_xlfn.XLOOKUP($A184,[1]Inf_general_desarrollo!$A:$A,[1]Inf_general_desarrollo!$F:$F)","v":"Huellas de cemento en cochera"},{"$f":"_xlfn.XLOOKUP($A184,[1]Inf_general_desarrollo!$A:$A,[1]Inf_general_desarrollo!$G:$G)","v":"Yeso pulido"},{"$f":"_xlfn.XLOOKUP($A184,[1]Inf_general_desarrollo!$A:$A,[1]Inf_general_desarrollo!$I:$I)","v":"Concreto"}]
["Ronda Residencial - Reserva san Matias","Horizontal","Gelsa",null,3,3,0,2,"115.5","130.33",7,"No",2,null,"Si","Si","Si","Calentador de paso",{"$f":"_xlfn.XLOOKUP(Tabla62[[#This Row],[Nombre_desarrollo]],[1]Inf_general_desarrollo!$A:$A,[1]Inf_general_desarrollo!$C:$C)","v":"Cerámico"},{"$f":"_xlfn.XLOOKUP($A185,[1]Inf_general_desarrollo!$A:$A,[1]Inf_general_desarrollo!$D:$D)","v":"60x60"},{"$f":"_xlfn.XLOOKUP($A185,[1]Inf_general_desarrollo!$A:$A,[1]Inf_general_desarrollo!$E:$E)","v":"Accesorios de baño, paredes en yeso."},{"$f":"_xlfn.XLOOKUP($A185,[1]Inf_general_desarrollo!$A:$A,[1]Inf_general_desarrollo!$F:$F)","v":"Huellas de cemento en cochera"},{"$f":"_xlfn.XLOOKUP($A185,[1]Inf_general_desarrollo!$A:$A,[1]Inf_general_desarrollo!$G:$G)","v":"Yeso pulido"},{"$f":"_xlfn.XLOOKUP($A185,[1]Inf_general_desarrollo!$A:$A,[1]Inf_general_desarrollo!$I:$I)","v":"Concreto"}]
["Ronda Residencial - Reserva san Matias","Horizontal","Borja",null,3,2,1,2,"115.5","118.26",7,"No",2,null,"Si","Si","Si","Calentador de paso",{"$f":"_xlfn.XLOOKUP(Tabla62[[#This Row],[Nombre_desarrollo]],[1]Inf_general_desarrollo!$A:$A,[1]Inf_general_desarrollo!$C:$C)","v":"Cerámico"},{"$f":"_xlfn.XLOOKUP($A186,[1]Inf_general_desarrollo!$A:$A,[1]Inf_general_desarrollo!$D:$D)","v":"60x60"},{"$f":"_xlfn.XLOOKUP($A186,[1]Inf_general_desarrollo!$A:$A,[1]Inf_general_desarrollo!$E:$E)","v":"Accesorios de baño, paredes en yeso."},{"$f":"_xlfn.XLOOKUP($A186,[1]Inf_general_desarrollo!$A:$A,[1]Inf_general_desarrollo!$F:$F)","v":"Huellas de cemento en cochera"},{"$f":"_xlfn.XLOOKUP($A186,[1]Inf_general_desarrollo!$A:$A,[1]Inf_general_desarrollo!$G:$G)","v":"Yeso pulido"},{"$f":"_xlfn.XLOOKUP($A186,[1]Inf_general_desarrollo!$A:$A,[1]Inf_general_desarrollo!$I:$I)","v":"Concreto"}]
["Ronda Residencial - Reserva san Matias","Horizontal","Neiva",null,2,2,0,2,"115.5","90.1",7,"No",2,null,"Si","Si","Si","Calentador de paso",{"$f":"_xlfn.XLOOKUP(Tabla62[[#This Row],[Nombre_desarrollo]],[1]Inf_general_desarrollo!$A:$A,[1]Inf_general_desarrollo!$C:$C)","v":"Cerámico"},{"$f":"_xlfn.XLOOKUP($A187,[1]Inf_general_desarrollo!$A:$A,[1]Inf_general_desarrollo!$D:$D)","v":"60x60"},{"$f":"_xlfn.XLOOKUP($A187,[1]Inf_general_desarrollo!$A:$A,[1]Inf_general_desarrollo!$E:$E)","v":"Accesorios de baño, paredes en yeso."},{"$f":"_xlfn.XLOOKUP($A187,[1]Inf_general_desarrollo!$A:$A,[1]Inf_general_desarrollo!$F:$F)","v":"Huellas de cemento en cochera"},{"$f":"_xlfn.XLOOKUP($A187,[1]Inf_general_desarrollo!$A:$A,[1]Inf_general_desarrollo!$G:$G)","v":"Yeso pulido"},{"$f":"_xlfn.XLOOKUP($A187,[1]Inf_general_desarrollo!$A:$A,[1]Inf_general_desarrollo!$I:$I)","v":"Concreto"}]
["Ronda Residencial - Reserva san Matias","Horizontal","Guinea",null,3,2,1,2,"115.5","144.8",7,"No",2,null,"Si","Si","Si","Calentador de paso",{"$f":"_xlfn.XLOOKUP(Tabla62[[#This Row],[Nombre_desarrollo]],[1]Inf_general_desarrollo!$A:$A,[1]Inf_general_desarrollo!$C:$C)","v":"Cerámico"},{"$f":"_xlfn.XLOOKUP($A188,[1]Inf_general_desarrollo!$A:$A,[1]Inf_general_desarrollo!$D:$D)","v":"60x60"},{"$f":"_xlfn.XLOOKUP($A188,[1]Inf_general_desarrollo!$A:$A,[1]Inf_general_desarrollo!$E:$E)","v":"Accesorios de baño, paredes en yeso."},{"$f":"_xlfn.XLOOKUP($A188,[1]Inf_general_desarrollo!$A:$A,[1]Inf_general_desarrollo!$F:$F)","v":"Huellas de cemento en cochera"},{"$f":"_xlfn.XLOOKUP($A188,[1]Inf_general_desarrollo!$A:$A,[1]Inf_general_desarrollo!$G:$G)","v":"Yeso pulido"},{"$f":"_xlfn.XLOOKUP($A188,[1]Inf_general_desarrollo!$A:$A,[1]Inf_general_desarrollo!$I:$I)","v":"Concreto"}]
["Villa de las Norias- VIP","Horizontal","Grijalva",null,3,1,1,2,90,72,6,"No",2,null,"No","Si","Si","Boiler.",{"$f":"_xlfn.XLOOKUP(Tabla62[[#This Row],[Nombre_desarrollo]],[1]Inf_general_desarrollo!$A:$A,[1]Inf_general_desarrollo!$C:$C)","v":"Cerámico"},{"$f":"_xlfn.XLOOKUP($A189,[1]Inf_general_desarrollo!$A:$A,[1]Inf_general_desarrollo!$D:$D)","v":"40x40"},{"$f":"_xlfn.XLOOKUP($A189,[1]Inf_general_desarrollo!$A:$A,[1]Inf_general_desarrollo!$E:$E)","v":"Aluminio blanco, muebles de baño sencillos, cluye closet."},{"$f":"_xlfn.XLOOKUP($A189,[1]Inf_general_desarrollo!$A:$A,[1]Inf_general_desarrollo!$F:$F)","v":"Huellas de cemento, ventanas con marco de aluminio blanco."},{"$f":"_xlfn.XLOOKUP($A189,[1]Inf_general_desarrollo!$A:$A,[1]Inf_general_desarrollo!$G:$G)","v":"Yeso"},{"$f":"_xlfn.XLOOKUP($A189,[1]Inf_general_desarrollo!$A:$A,[1]Inf_general_desarrollo!$I:$I)","v":"Concreto"}]
["Villa de las Norias - VIP","Horizontal","Ameca",null,2,1,1,2,75,"63.85",6,"No",2,null,"No","Si","Si","Boiler.",{"$f":"_xlfn.XLOOKUP(Tabla62[[#This Row],[Nombre_desarrollo]],[1]Inf_general_desarrollo!$A:$A,[1]Inf_general_desarrollo!$C:$C)","v":"Cerámico"},{"$f":"_xlfn.XLOOKUP($A190,[1]Inf_general_desarrollo!$A:$A,[1]Inf_general_desarrollo!$D:$D)","v":"40x40"},{"$f":"_xlfn.XLOOKUP($A190,[1]Inf_general_desarrollo!$A:$A,[1]Inf_general_desarrollo!$E:$E)","v":"Aluminio blanco, muebles de baño sencillos, cluye closet."},{"$f":"_xlfn.XLOOKUP($A190,[1]Inf_general_desarrollo!$A:$A,[1]Inf_general_desarrollo!$F:$F)","v":"Huellas de cemento, ventanas con marco de aluminio blanco."},{"$f":"_xlfn.XLOOKUP($A190,[1]Inf_general_desarrollo!$A:$A,[1]Inf_general_desarrollo!$G:$G)","v":"Yeso"},{"$f":"_xlfn.XLOOKUP($A190,[1]Inf_general_desarrollo!$A:$A,[1]Inf_general_desarrollo!$I:$I)","v":"Concreto"}]
["Villa de las Norias - VIP","Horizontal","Pirul",null,2,1,1,2,90,72,6,"No",2,null,"No","Si","Si","Boiler.",{"$f":"_xlfn.XLOOKUP(Tabla62[[#This Row],[Nombre_desarrollo]],[1]Inf_general_desarrollo!$A:$A,[1]Inf_general_desarrollo!$C:$C)","v":"Cerámico"},{"$f":"_xlfn.XLOOKUP($A191,[1]Inf_general_desarrollo!$A:$A,[1]Inf_general_desarrollo!$D:$D)","v":"40x40"},{"$f":"_xlfn.XLOOKUP($A191,[1]Inf_general_desarrollo!$A:$A,[1]Inf_general_desarrollo!$E:$E)","v":"Aluminio blanco, muebles de baño sencillos, cluye closet."},{"$f":"_xlfn.XLOOKUP($A191,[1]Inf_general_desarrollo!$A:$A,[1]Inf_general_desarrollo!$F:$F)","v":"Huellas de cemento, ventanas con marco de aluminio blanco."},{"$f":"_xlfn.XLOOKUP($A191,[1]Inf_general_desarrollo!$A:$A,[1]Inf_general_desarrollo!$G:$G)","v":"Yeso"},{"$f":"_xlfn.XLOOKUP($A191,[1]Inf_general_desarrollo!$A:$A,[1]Inf_general_desarrollo!$I:$I)","v":"Concreto"}]
["Caranday II- Coto Bettel","Horizontal","Blanc",null,4,3,0,2,102,"129.7",6,"Si",2,null,"Si","Si","Si","Minsplit, boiler",{"$f":"_xlfn.XLOOKUP(Tabla62[[#This Row],[Nombre_desarrollo]],[1]Inf_general_desarrollo!$A:$A,[1]Inf_general_desarrollo!$C:$C)","v":"Cerámico"},{"$f":"_xlfn.XLOOKUP($A192,[1]Inf_general_desarrollo!$A:$A,[1]Inf_general_desarrollo!$D:$D)","v":"60x60"},{"$f":"_xlfn.XLOOKUP($A192,[1]Inf_general_desarrollo!$A:$A,[1]Inf_general_desarrollo!$E:$E)","v":"yeso pulido, cocina de madera y granito, pisos cerámicos."},{"$f":"_xlfn.XLOOKUP($A192,[1]Inf_general_desarrollo!$A:$A,[1]Inf_general_desarrollo!$F:$F)","v":"yeso pulido, vistas de fachaleta"},{"$f":"_xlfn.XLOOKUP($A192,[1]Inf_general_desarrollo!$A:$A,[1]Inf_general_desarrollo!$G:$G)","v":0},{"$f":"_xlfn.XLOOKUP($A192,[1]Inf_general_desarrollo!$A:$A,[1]Inf_general_desarrollo!$I:$I)","v":"Concreto"}]
["Caranday II- Coto Bettel","Horizontal","Platino",null,4,3,1,2,102,"142.3",6,"Si",2,null,"Si","Si","Si","Minsplit, boiler",{"$f":"_xlfn.XLOOKUP(Tabla62[[#This Row],[Nombre_desarrollo]],[1]Inf_general_desarrollo!$A:$A,[1]Inf_general_desarrollo!$C:$C)","v":"Cerámico"},{"$f":"_xlfn.XLOOKUP($A193,[1]Inf_general_desarrollo!$A:$A,[1]Inf_general_desarrollo!$D:$D)","v":"60x60"},{"$f":"_xlfn.XLOOKUP($A193,[1]Inf_general_desarrollo!$A:$A,[1]Inf_general_desarrollo!$E:$E)","v":"yeso pulido, cocina de madera y granito, pisos cerámicos."},{"$f":"_xlfn.XLOOKUP($A193,[1]Inf_general_desarrollo!$A:$A,[1]Inf_general_desarrollo!$F:$F)","v":"yeso pulido, vistas de fachaleta"},{"$f":"_xlfn.XLOOKUP($A193,[1]Inf_general_desarrollo!$A:$A,[1]Inf_general_desarrollo!$G:$G)","v":0},{"$f":"_xlfn.XLOOKUP($A193,[1]Inf_general_desarrollo!$A:$A,[1]Inf_general_desarrollo!$I:$I)","v":"Concreto"}]
["Caranday II- Coto Bettel","Horizontal","Platino_1",null,4,3,1,2,160,168,8,"Si",2,null,"Si","Si","Si","Minsplit, boiler",{"$f":"_xlfn.XLOOKUP(Tabla62[[#This Row],[Nombre_desarrollo]],[1]Inf_general_desarrollo!$A:$A,[1]Inf_general_desarrollo!$C:$C)","v":"Cerámico"},{"$f":"_xlfn.XLOOKUP($A194,[1]Inf_general_desarrollo!$A:$A,[1]Inf_general_desarrollo!$D:$D)","v":"60x60"},{"$f":"_xlfn.XLOOKUP($A194,[1]Inf_general_desarrollo!$A:$A,[1]Inf_general_desarrollo!$E:$E)","v":"yeso pulido, cocina de madera y granito, pisos cerámicos."},{"$f":"_xlfn.XLOOKUP($A194,[1]Inf_general_desarrollo!$A:$A,[1]Inf_general_desarrollo!$F:$F)","v":"yeso pulido, vistas de fachaleta"},{"$f":"_xlfn.XLOOKUP($A194,[1]Inf_general_desarrollo!$A:$A,[1]Inf_general_desarrollo!$G:$G)","v":0},{"$f":"_xlfn.XLOOKUP($A194,[1]Inf_general_desarrollo!$A:$A,[1]Inf_general_desarrollo!$I:$I)","v":"Concreto"}]
["Caranday II- Coto Bettel","Horizontal","Blanc",null,4,3,1,2,160,182,8,"Si",2,null,"Si","Si","Si","Minsplit, boiler",{"$f":"_xlfn.XLOOKUP(Tabla62[[#This Row],[Nombre_desarrollo]],[1]Inf_general_desarrollo!$A:$A,[1]Inf_general_desarrollo!$C:$C)","v":"Cerámico"},{"$f":"_xlfn.XLOOKUP($A195,[1]Inf_general_desarrollo!$A:$A,[1]Inf_general_desarrollo!$D:$D)","v":"60x60"},{"$f":"_xlfn.XLOOKUP($A195,[1]Inf_general_desarrollo!$A:$A,[1]Inf_general_desarrollo!$E:$E)","v":"yeso pulido, cocina de madera y granito, pisos cerámicos."},{"$f":"_xlfn.XLOOKUP($A195,[1]Inf_general_desarrollo!$A:$A,[1]Inf_general_desarrollo!$F:$F)","v":"yeso pulido, vistas de fachaleta"},{"$f":"_xlfn.XLOOKUP($A195,[1]Inf_general_desarrollo!$A:$A,[1]Inf_general_desarrollo!$G:$G)","v":0},{"$f":"_xlfn.XLOOKUP($A195,[1]Inf_general_desarrollo!$A:$A,[1]Inf_general_desarrollo!$I:$I)","v":"Concreto"}]
["Viñedos Ribier","Horizontal","Asti",null,2,2,0,1,126,"75.77",7,"Si",2,null,"Si","Si","Si","Minsplit, boiler",{"$f":"_xlfn.XLOOKUP(Tabla62[[#This Row],[Nombre_desarrollo]],[1]Inf_general_desarrollo!$A:$A,[1]Inf_general_desarrollo!$C:$C)","v":"Cerámico"},{"$f":"_xlfn.XLOOKUP($A196,[1]Inf_general_desarrollo!$A:$A,[1]Inf_general_desarrollo!$D:$D)","v":"60x60"},{"$f":"_xlfn.XLOOKUP($A196,[1]Inf_general_desarrollo!$A:$A,[1]Inf_general_desarrollo!$E:$E)","v":"yeso pulido, cocina de madera y granito, pisos cerámicos tipo madera en recamaras."},{"$f":"_xlfn.XLOOKUP($A196,[1]Inf_general_desarrollo!$A:$A,[1]Inf_general_desarrollo!$F:$F)","v":"yeso pulido y acabados rusticos"},{"$f":"_xlfn.XLOOKUP($A196,[1]Inf_general_desarrollo!$A:$A,[1]Inf_general_desarrollo!$G:$G)","v":0},{"$f":"_xlfn.XLOOKUP($A196,[1]Inf_general_desarrollo!$A:$A,[1]Inf_general_desarrollo!$I:$I)","v":"Concreto"}]
["Viñedos Ribier","Horizontal","Cerdena",null,3,3,0,2,126,"109.75",7,"Si",2,null,"Si","Si","Si","Minsplit, boiler",{"$f":"_xlfn.XLOOKUP(Tabla62[[#This Row],[Nombre_desarrollo]],[1]Inf_general_desarrollo!$A:$A,[1]Inf_general_desarrollo!$C:$C)","v":"Cerámico"},{"$f":"_xlfn.XLOOKUP($A197,[1]Inf_general_desarrollo!$A:$A,[1]Inf_general_desarrollo!$D:$D)","v":"60x60"},{"$f":"_xlfn.XLOOKUP($A197,[1]Inf_general_desarrollo!$A:$A,[1]Inf_general_desarrollo!$E:$E)","v":"yeso pulido, cocina de madera y granito, pisos cerámicos tipo madera en recamaras."},{"$f":"_xlfn.XLOOKUP($A197,[1]Inf_general_desarrollo!$A:$A,[1]Inf_general_desarrollo!$F:$F)","v":"yeso pulido y acabados rusticos"},{"$f":"_xlfn.XLOOKUP($A197,[1]Inf_general_desarrollo!$A:$A,[1]Inf_general_desarrollo!$G:$G)","v":0},{"$f":"_xlfn.XLOOKUP($A197,[1]Inf_general_desarrollo!$A:$A,[1]Inf_general_desarrollo!$I:$I)","v":"Concreto"}]
["Viñedos Ribier","Horizontal","Rioja",null,4,3,0,2,126,"112.84",7,"Si",2,null,"Si","Si","Si","Minsplit, boiler",{"$f":"_xlfn.XLOOKUP(Tabla62[[#This Row],[Nombre_desarrollo]],[1]Inf_general_desarrollo!$A:$A,[1]Inf_general_desarrollo!$C:$C)","v":"Cerámico"},{"$f":"_xlfn.XLOOKUP($A198,[1]Inf_general_desarrollo!$A:$A,[1]Inf_general_desarrollo!$D:$D)","v":"60x60"},{"$f":"_xlfn.XLOOKUP($A198,[1]Inf_general_desarrollo!$A:$A,[1]Inf_general_desarrollo!$E:$E)","v":"yeso pulido, cocina de madera y granito, pisos cerámicos tipo madera en recamaras."},{"$f":"_xlfn.XLOOKUP($A198,[1]Inf_general_desarrollo!$A:$A,[1]Inf_general_desarrollo!$F:$F)","v":"yeso pulido y acabados rusticos"},{"$f":"_xlfn.XLOOKUP($A198,[1]Inf_general_desarrollo!$A:$A,[1]Inf_general_desarrollo!$G:$G)","v":0},{"$f":"_xlfn.XLOOKUP($A198,[1]Inf_general_desarrollo!$A:$A,[1]Inf_general_desarrollo!$I:$I)","v":"Concreto"}]
["Viñedos Ribier","Horizontal","Victoria",null,4,3,0,2,126,"123.23",7,"Si",2,null,"Si","Si","Si","Minsplit, boiler",{"$f":"_xlfn.XLOOKUP(Tabla62[[#This Row],[Nombre_desarrollo]],[1]Inf_general_desarrollo!$A:$A,[1]Inf_general_desarrollo!$C:$C)","v":"Cerámico"},{"$f":"_xlfn.XLOOKUP($A199,[1]Inf_general_desarrollo!$A:$A,[1]Inf_general_desarrollo!$D:$D)","v":"60x60"},{"$f":"_xlfn.XLOOKUP($A199,[1]Inf_general_desarrollo!$A:$A,[1]Inf_general_desarrollo!$E:$E)","v":"yeso pulido, cocina de madera y granito, pisos cerámicos tipo madera en recamaras."},{"$f":"_xlfn.XLOOKUP($A199,[1]Inf_general_desarrollo!$A:$A,[1]Inf_general_desarrollo!$F:$F)","v":"yeso pulido y acabados rusticos"},{"$f":"_xlfn.XLOOKUP($A199,[1]Inf_general_desarrollo!$A:$A,[1]Inf_general_desarrollo!$G:$G)","v":0},{"$f":"_xlfn.XLOOKUP($A199,[1]Inf_general_desarrollo!$A:$A,[1]Inf_general_desarrollo!$I:$I)","v":"Concreto"}]
["Viñedos Ribier","Horizontal","Volnay",null,2,2,1,2,126,97.78,7,"Si",2,null,"Si","Si","Si","Minsplit, boiler",{"$f":"_xlfn.XLOOKUP(Tabla62[[#This Row],[Nombre_desarrollo]],[1]Inf_general_desarrollo!$A:$A,[1]Inf_general_desarrollo!$C:$C)","v":"Cerámico"},{"$f":"_xlfn.XLOOKUP($A200,[1]Inf_general_desarrollo!$A:$A,[1]Inf_general_desarrollo!$D:$D)","v":"60x60"},{"$f":"_xlfn.XLOOKUP($A200,[1]Inf_general_desarrollo!$A:$A,[1]Inf_general_desarrollo!$E:$E)","v":"yeso pulido, cocina de madera y granito, pisos cerámicos tipo madera en recamaras."},{"$f":"_xlfn.XLOOKUP($A200,[1]Inf_general_desarrollo!$A:$A,[1]Inf_general_desarrollo!$F:$F)","v":"yeso pulido y acabados rusticos"},{"$f":"_xlfn.XLOOKUP($A200,[1]Inf_general_desarrollo!$A:$A,[1]Inf_general_desarrollo!$G:$G)","v":0},{"$f":"_xlfn.XLOOKUP($A200,[1]Inf_general_desarrollo!$A:$A,[1]Inf_general_desarrollo!$I:$I)","v":"Concreto"}]
["Viñedos Ribier","Horizontal","Montilla",null,3,3,0,2,126,103.25,7,"Si",2,null,"Si","Si","Si","Minsplit, boiler",{"$f":"_xlfn.XLOOKUP(Tabla62[[#This Row],[Nombre_desarrollo]],[1]Inf_general_desarrollo!$A:$A,[1]Inf_general_desarrollo!$C:$C)","v":"Cerámico"},{"$f":"_xlfn.XLOOKUP($A201,[1]Inf_general_desarrollo!$A:$A,[1]Inf_general_desarrollo!$D:$D)","v":"60x60"},{"$f":"_xlfn.XLOOKUP($A201,[1]Inf_general_desarrollo!$A:$A,[1]Inf_general_desarrollo!$E:$E)","v":"yeso pulido, cocina de madera y granito, pisos cerámicos tipo madera en recamaras."},{"$f":"_xlfn.XLOOKUP($A201,[1]Inf_general_desarrollo!$A:$A,[1]Inf_general_desarrollo!$F:$F)","v":"yeso pulido y acabados rusticos"},{"$f":"_xlfn.XLOOKUP($A201,[1]Inf_general_desarrollo!$A:$A,[1]Inf_general_desarrollo!$G:$G)","v":0},{"$f":"_xlfn.XLOOKUP($A201,[1]Inf_general_desarrollo!$A:$A,[1]Inf_general_desarrollo!$I:$I)","v":"Concreto"}]
["Olena residencial","Horizontal","Olena_1",null,2,2,1,2,"112.5",119,6,"Si",2,null,"Si","Si","Si","minsplit, boiler",{"$f":"_xlfn.XLOOKUP(Tabla62[[#This Row],[Nombre_desarrollo]],[1]Inf_general_desarrollo!$A:$A,[1]Inf_general_desarrollo!$C:$C)","v":"Cerámico"},{"$f":"_xlfn.XLOOKUP($A202,[1]Inf_general_desarrollo!$A:$A,[1]Inf_general_desarrollo!$D:$D)","v":"60x60"},{"$f":"_xlfn.XLOOKUP($A202,[1]Inf_general_desarrollo!$A:$A,[1]Inf_general_desarrollo!$E:$E)","v":"yeso pulido, cocina de madera y granito, pisos cerámicos."},{"$f":"_xlfn.XLOOKUP($A202,[1]Inf_general_desarrollo!$A:$A,[1]Inf_general_desarrollo!$F:$F)","v":"Muros con detalles de loseta tipo madera, herreria en cochera"},{"$f":"_xlfn.XLOOKUP($A202,[1]Inf_general_desarrollo!$A:$A,[1]Inf_general_desarrollo!$G:$G)","v":"Yeso pulido"},{"$f":"_xlfn.XLOOKUP($A202,[1]Inf_general_desarrollo!$A:$A,[1]Inf_general_desarrollo!$I:$I)","v":"Concreto"}]
["Olena residencial","Horizontal","Olena_2",null,2,3,0,2,"112.5",129,6,"Si",2,null,"Si","Si","Si","minsplit, boiler",{"$f":"_xlfn.XLOOKUP(Tabla62[[#This Row],[Nombre_desarrollo]],[1]Inf_general_desarrollo!$A:$A,[1]Inf_general_desarrollo!$C:$C)","v":"Cerámico"},{"$f":"_xlfn.XLOOKUP($A203,[1]Inf_general_desarrollo!$A:$A,[1]Inf_general_desarrollo!$D:$D)","v":"60x60"},{"$f":"_xlfn.XLOOKUP($A203,[1]Inf_general_desarrollo!$A:$A,[1]Inf_general_desarrollo!$E:$E)","v":"yeso pulido, cocina de madera y granito, pisos cerámicos."},{"$f":"_xlfn.XLOOKUP($A203,[1]Inf_general_desarrollo!$A:$A,[1]Inf_general_desarrollo!$F:$F)","v":"Muros con detalles de loseta tipo madera, herreria en cochera"},{"$f":"_xlfn.XLOOKUP($A203,[1]Inf_general_desarrollo!$A:$A,[1]Inf_general_desarrollo!$G:$G)","v":"Yeso pulido"},{"$f":"_xlfn.XLOOKUP($A203,[1]Inf_general_desarrollo!$A:$A,[1]Inf_general_desarrollo!$I:$I)","v":"Concreto"}]
["Olena residencial","Horizontal","Olena_3",null,2,2,1,2,"112.5",143,6,"Si",2,null,"Si","Si","Si","minsplit, boiler",{"$f":"_xlfn.XLOOKUP(Tabla62[[#This Row],[Nombre_desarrollo]],[1]Inf_general_desarrollo!$A:$A,[1]Inf_general_desarrollo!$C:$C)","v":"Cerámico"},{"$f":"_xlfn.XLOOKUP($A204,[1]Inf_general_desarrollo!$A:$A,[1]Inf_general_desarrollo!$D:$D)","v":"60x60"},{"$f":"_xlfn.XLOOKUP($A204,[1]Inf_general_desarrollo!$A:$A,[1]Inf_general_desarrollo!$E:$E)","v":"yeso pulido, cocina de madera y granito, pisos cerámicos."},{"$f":"_xlfn.XLOOKUP($A204,[1]Inf_general_desarrollo!$A:$A,[1]Inf_general_desarrollo!$F:$F)","v":"Muros con detalles de loseta tipo madera, herreria en cochera"},{"$f":"_xlfn.XLOOKUP($A204,[1]Inf_general_desarrollo!$A:$A,[1]Inf_general_desarrollo!$G:$G)","v":"Yeso pulido"},{"$f":"_xlfn.XLOOKUP($A204,[1]Inf_general_desarrollo!$A:$A,[1]Inf_general_desarrollo!$I:$I)","v":"Concreto"}]
["Olena residencial","Horizontal","Olena_4",null,3,4,0,2,"112.5",158,6,"Si",2,null,"Si","Si","Si","minsplit, boiler",{"$f":"_xlfn.XLOOKUP(Tabla62[[#This Row],[Nombre_desarrollo]],[1]Inf_general_desarrollo!$A:$A,[1]Inf_general_desarrollo!$C:$C)","v":"Cerámico"},{"$f":"_xlfn.XLOOKUP($A205,[1]Inf_general_desarrollo!$A:$A,[1]Inf_general_desarrollo!$D:$D)","v":"60x60"},{"$f":"_xlfn.XLOOKUP($A205,[1]Inf_general_desarrollo!$A:$A,[1]Inf_general_desarrollo!$E:$E)","v":"yeso pulido, cocina de madera y granito, pisos cerámicos."},{"$f":"_xlfn.XLOOKUP($A205,[1]Inf_general_desarrollo!$A:$A,[1]Inf_general_desarrollo!$F:$F)","v":"Muros con detalles de loseta tipo madera, herreria en cochera"},{"$f":"_xlfn.XLOOKUP($A205,[1]Inf_general_desarrollo!$A:$A,[1]Inf_general_desarrollo!$G:$G)","v":"Yeso pulido"},{"$f":"_xlfn.XLOOKUP($A205,[1]Inf_general_desarrollo!$A:$A,[1]Inf_general_desarrollo!$I:$I)","v":"Concreto"}]
["Real del Sol","Horizontal","Jacaranda",null,2,1,1,2,72,"65.5",6,"No",1,null,"Si","Si","No","Instalaciones para boiler, gas, tinaco, lavadora.",{"$f":"_xlfn.XLOOKUP(Tabla62[[#This Row],[Nombre_desarrollo]],[1]Inf_general_desarrollo!$A:$A,[1]Inf_general_desarrollo!$C:$C)","v":"Cerámico"},{"$f":"_xlfn.XLOOKUP($A206,[1]Inf_general_desarrollo!$A:$A,[1]Inf_general_desarrollo!$D:$D)","v":"60x60"},{"$f":"_xlfn.XLOOKUP($A206,[1]Inf_general_desarrollo!$A:$A,[1]Inf_general_desarrollo!$E:$E)","v":"Enyesado, muebles de baño sencillos, pisos cerámicos"},{"$f":"_xlfn.XLOOKUP($A206,[1]Inf_general_desarrollo!$A:$A,[1]Inf_general_desarrollo!$F:$F)","v":"Protecciones de herreria"},{"$f":"_xlfn.XLOOKUP($A206,[1]Inf_general_desarrollo!$A:$A,[1]Inf_general_desarrollo!$G:$G)","v":"Yeso pulido"},{"$f":"_xlfn.XLOOKUP($A206,[1]Inf_general_desarrollo!$A:$A,[1]Inf_general_desarrollo!$I:$I)","v":"Concreto"}]
["Real del Sol","Horizontal","Roble",null,3,1,0,2,96,"77.37",6,"No",1,null,"Si","Si","No","Instalaciones para boiler, gas, tinaco, lavadora.",{"$f":"_xlfn.XLOOKUP(Tabla62[[#This Row],[Nombre_desarrollo]],[1]Inf_general_desarrollo!$A:$A,[1]Inf_general_desarrollo!$C:$C)","v":"Cerámico"},{"$f":"_xlfn.XLOOKUP($A207,[1]Inf_general_desarrollo!$A:$A,[1]Inf_general_desarrollo!$D:$D)","v":"60x60"},{"$f":"_xlfn.XLOOKUP($A207,[1]Inf_general_desarrollo!$A:$A,[1]Inf_general_desarrollo!$E:$E)","v":"Enyesado, muebles de baño sencillos, pisos cerámicos"},{"$f":"_xlfn.XLOOKUP($A207,[1]Inf_general_desarrollo!$A:$A,[1]Inf_general_desarrollo!$F:$F)","v":"Protecciones de herreria"},{"$f":"_xlfn.XLOOKUP($A207,[1]Inf_general_desarrollo!$A:$A,[1]Inf_general_desarrollo!$G:$G)","v":"Yeso pulido"},{"$f":"_xlfn.XLOOKUP($A207,[1]Inf_general_desarrollo!$A:$A,[1]Inf_general_desarrollo!$I:$I)","v":"Concreto"}]
["Real del Sol","Horizontal","Granado",null,3,2,0,1,96,62,6,"No",1,null,"Si","Si","No","Instalaciones para boiler, gas, tinaco, lavadora.",{"$f":"_xlfn.XLOOKUP(Tabla62[[#This Row],[Nombre_desarrollo]],[1]Inf_general_desarrollo!$A:$A,[1]Inf_general_desarrollo!$C:$C)","v":"Cerámico"},{"$f":"_xlfn.XLOOKUP($A208,[1]Inf_general_desarrollo!$A:$A,[1]Inf_general_desarrollo!$D:$D)","v":"60x60"},{"$f":"_xlfn.XLOOKUP($A208,[1]Inf_general_desarrollo!$A:$A,[1]Inf_general_desarrollo!$E:$E)","v":"Enyesado, muebles de baño sencillos, pisos cerámicos"},{"$f":"_xlfn.XLOOKUP($A208,[1]Inf_general_desarrollo!$A:$A,[1]Inf_general_desarrollo!$F:$F)","v":"Protecciones de herreria"},{"$f":"_xlfn.XLOOKUP($A208,[1]Inf_general_desarrollo!$A:$A,[1]Inf_general_desarrollo!$G:$G)","v":"Yeso pulido"},{"$f":"_xlfn.XLOOKUP($A208,[1]Inf_general_desarrollo!$A:$A,[1]Inf_general_desarrollo!$I:$I)","v":"Concreto"}]
["Real del Sol","Horizontal","Alamo",null,3,3,0,2,96,"92.84",6,"No",1,null,"Si","Si","No","Instalaciones para boiler, gas, tinaco, lavadora.",{"$f":"_xlfn.XLOOKUP(Tabla62[[#This Row],[Nombre_desarrollo]],[1]Inf_general_desarrollo!$A:$A,[1]Inf_general_desarrollo!$C:$C)","v":"Cerámico"},{"$f":"_xlfn.XLOOKUP($A209,[1]Inf_general_desarrollo!$A:$A,[1]Inf_general_desarrollo!$D:$D)","v":"60x60"},{"$f":"_xlfn.XLOOKUP($A209,[1]Inf_general_desarrollo!$A:$A,[1]Inf_general_desarrollo!$E:$E)","v":"Enyesado, muebles de baño sencillos, pisos cerámicos"},{"$f":"_xlfn.XLOOKUP($A209,[1]Inf_general_desarrollo!$A:$A,[1]Inf_general_desarrollo!$F:$F)","v":"Protecciones de herreria"},{"$f":"_xlfn.XLOOKUP($A209,[1]Inf_general_desarrollo!$A:$A,[1]Inf_general_desarrollo!$G:$G)","v":"Yeso pulido"},{"$f":"_xlfn.XLOOKUP($A209,[1]Inf_general_desarrollo!$A:$A,[1]Inf_general_desarrollo!$I:$I)","v":"Concreto"}]
["Real del Sol","Horizontal","Cian",null,3,2,1,2,96,78.42,6,"No",1,null,"Si","Si","No","Instalaciones para boiler, gas, tinaco, lavadora.",{"$f":"_xlfn.XLOOKUP(Tabla62[[#This Row],[Nombre_desarrollo]],[1]Inf_general_desarrollo!$A:$A,[1]Inf_general_desarrollo!$C:$C)","v":"Cerámico"},{"$f":"_xlfn.XLOOKUP($A210,[1]Inf_general_desarrollo!$A:$A,[1]Inf_general_desarrollo!$D:$D)","v":"60x60"},{"$f":"_xlfn.XLOOKUP($A210,[1]Inf_general_desarrollo!$A:$A,[1]Inf_general_desarrollo!$E:$E)","v":"Enyesado, muebles de baño sencillos, pisos cerámicos"},{"$f":"_xlfn.XLOOKUP($A210,[1]Inf_general_desarrollo!$A:$A,[1]Inf_general_desarrollo!$F:$F)","v":"Protecciones de herreria"},{"$f":"_xlfn.XLOOKUP($A210,[1]Inf_general_desarrollo!$A:$A,[1]Inf_general_desarrollo!$G:$G)","v":"Yeso pulido"},{"$f":"_xlfn.XLOOKUP($A210,[1]Inf_general_desarrollo!$A:$A,[1]Inf_general_desarrollo!$I:$I)","v":"Concreto"}]
["Vilanova Casas","Horizontal","Ventura",null,3,3,0,2,102,"86.1",6,"-",2,null,"Si","Si","Si",null,{"$f":"_xlfn.XLOOKUP(Tabla62[[#This Row],[Nombre_desarrollo]],[1]Inf_general_desarrollo!$A:$A,[1]Inf_general_desarrollo!$C:$C)","v":"Rectificado"},{"$f":"_xlfn.XLOOKUP($A211,[1]Inf_general_desarrollo!$A:$A,[1]Inf_general_desarrollo!$D:$D)","v":"60x60"},{"$f":"_xlfn.XLOOKUP($A211,[1]Inf_general_desarrollo!$A:$A,[1]Inf_general_desarrollo!$E:$E)","v":"Yeso pulido en paredes, acabados en pintura blanca, revestimiento en regaderas."},{"$f":"_xlfn.XLOOKUP($A211,[1]Inf_general_desarrollo!$A:$A,[1]Inf_general_desarrollo!$F:$F)","v":"Huellas de cemento en cochera, marcos de aluminio en color blanco, herreria en balcones."},{"$f":"_xlfn.XLOOKUP($A211,[1]Inf_general_desarrollo!$A:$A,[1]Inf_general_desarrollo!$G:$G)","v":"Yeso pulido"},{"$f":"_xlfn.XLOOKUP($A211,[1]Inf_general_desarrollo!$A:$A,[1]Inf_general_desarrollo!$I:$I)","v":"Concreto Hidráulico"}]
["Vilanova Casas","Horizontal","Fortuna",null,3,3,0,2,102,"101.6",6,"-",2,null,"Si","Si","Si","-",{"$f":"_xlfn.XLOOKUP(Tabla62[[#This Row],[Nombre_desarrollo]],[1]Inf_general_desarrollo!$A:$A,[1]Inf_general_desarrollo!$C:$C)","v":"Rectificado"},{"$f":"_xlfn.XLOOKUP($A212,[1]Inf_general_desarrollo!$A:$A,[1]Inf_general_desarrollo!$D:$D)","v":"60x60"},{"$f":"_xlfn.XLOOKUP($A212,[1]Inf_general_desarrollo!$A:$A,[1]Inf_general_desarrollo!$E:$E)","v":"Yeso pulido en paredes, acabados en pintura blanca, revestimiento en regaderas."},{"$f":"_xlfn.XLOOKUP($A212,[1]Inf_general_desarrollo!$A:$A,[1]Inf_general_desarrollo!$F:$F)","v":"Huellas de cemento en cochera, marcos de aluminio en color blanco, herreria en balcones."},{"$f":"_xlfn.XLOOKUP($A212,[1]Inf_general_desarrollo!$A:$A,[1]Inf_general_desarrollo!$G:$G)","v":"Yeso pulido"},{"$f":"_xlfn.XLOOKUP($A212,[1]Inf_general_desarrollo!$A:$A,[1]Inf_general_desarrollo!$I:$I)","v":"Concreto Hidráulico"}]
["Vilanova Casas","Horizontal","Bonanza ",null,4,3,0,2,102,"112.9",6,"-",2,null,"Si","Si","Si","-",{"$f":"_xlfn.XLOOKUP(Tabla62[[#This Row],[Nombre_desarrollo]],[1]Inf_general_desarrollo!$A:$A,[1]Inf_general_desarrollo!$C:$C)","v":"Rectificado"},{"$f":"_xlfn.XLOOKUP($A213,[1]Inf_general_desarrollo!$A:$A,[1]Inf_general_desarrollo!$D:$D)","v":"60x60"},{"$f":"_xlfn.XLOOKUP($A213,[1]Inf_general_desarrollo!$A:$A,[1]Inf_general_desarrollo!$E:$E)","v":"Yeso pulido en paredes, acabados en pintura blanca, revestimiento en regaderas."},{"$f":"_xlfn.XLOOKUP($A213,[1]Inf_general_desarrollo!$A:$A,[1]Inf_general_desarrollo!$F:$F)","v":"Huellas de cemento en cochera, marcos de aluminio en color blanco, herreria en balcones."},{"$f":"_xlfn.XLOOKUP($A213,[1]Inf_general_desarrollo!$A:$A,[1]Inf_general_desarrollo!$G:$G)","v":"Yeso pulido"},{"$f":"_xlfn.XLOOKUP($A213,[1]Inf_general_desarrollo!$A:$A,[1]Inf_general_desarrollo!$I:$I)","v":"Concreto Hidráulico"}]
["Vilanova Casas","Horizontal","Victoria",null,3,3,1,2,102,"133.3",6,"-",2,null,"Si","Si","Si","-",{"$f":"_xlfn.XLOOKUP(Tabla62[[#This Row],[Nombre_desarrollo]],[1]Inf_general_desarrollo!$A:$A,[1]Inf_general_desarrollo!$C:$C)","v":"Rectificado"},{"$f":"_xlfn.XLOOKUP($A214,[1]Inf_general_desarrollo!$A:$A,[1]Inf_general_desarrollo!$D:$D)","v":"60x60"},{"$f":"_xlfn.XLOOKUP($A214,[1]Inf_general_desarrollo!$A:$A,[1]Inf_general_desarrollo!$E:$E)","v":"Yeso pulido en paredes, acabados en pintura blanca, revestimiento en regaderas."},{"$f":"_xlfn.XLOOKUP($A214,[1]Inf_general_desarrollo!$A:$A,[1]Inf_general_desarrollo!$F:$F)","v":"Huellas de cemento en cochera, marcos de aluminio en color blanco, herreria en balcones."},{"$f":"_xlfn.XLOOKUP($A214,[1]Inf_general_desarrollo!$A:$A,[1]Inf_general_desarrollo!$G:$G)","v":"Yeso pulido"},{"$f":"_xlfn.XLOOKUP($A214,[1]Inf_general_desarrollo!$A:$A,[1]Inf_general_desarrollo!$I:$I)","v":"Concreto Hidráulico"}]
["Vilanova Casas","Horizontal","Prosperidad",null,2,2,1,2,102,"93.80",6,"-",2,null,"Si","Si","Si","-",{"$f":"_xlfn.XLOOKUP(Tabla62[[#This Row],[Nombre_desarrollo]],[1]Inf_general_desarrollo!$A:$A,[1]Inf_general_desarrollo!$C:$C)","v":"Rectificado"},{"$f":"_xlfn.XLOOKUP($A215,[1]Inf_general_desarrollo!$A:$A,[1]Inf_general_desarrollo!$D:$D)","v":"60x60"},{"$f":"_xlfn.XLOOKUP($A215,[1]Inf_general_desarrollo!$A:$A,[1]Inf_general_desarrollo!$E:$E)","v":"Yeso pulido en paredes, acabados en pintura blanca, revestimiento en regaderas."},{"$f":"_xlfn.XLOOKUP($A215,[1]Inf_general_desarrollo!$A:$A,[1]Inf_general_desarrollo!$F:$F)","v":"Huellas de cemento en cochera, marcos de aluminio en color blanco, herreria en balcones."},{"$f":"_xlfn.XLOOKUP($A215,[1]Inf_general_desarrollo!$A:$A,[1]Inf_general_desarrollo!$G:$G)","v":"Yeso pulido"},{"$f":"_xlfn.XLOOKUP($A215,[1]Inf_general_desarrollo!$A:$A,[1]Inf_general_desarrollo!$I:$I)","v":"Concreto Hidráulico"}]
["Vilanova Casas","Horizontal","Esperanza",null,2,2,1,2,102,"82.92",6,"-",2,null,"Si","Si","Si","-",{"$f":"_xlfn.XLOOKUP(Tabla62[[#This Row],[Nombre_desarrollo]],[1]Inf_general_desarrollo!$A:$A,[1]Inf_general_desarrollo!$C:$C)","v":"Rectificado"},{"$f":"_xlfn.XLOOKUP($A216,[1]Inf_general_desarrollo!$A:$A,[1]Inf_general_desarrollo!$D:$D)","v":"60x60"},{"$f":"_xlfn.XLOOKUP($A216,[1]Inf_general_desarrollo!$A:$A,[1]Inf_general_desarrollo!$E:$E)","v":"Yeso pulido en paredes, acabados en pintura blanca, revestimiento en regaderas."},{"$f":"_xlfn.XLOOKUP($A216,[1]Inf_general_desarrollo!$A:$A,[1]Inf_general_desarrollo!$F:$F)","v":"Huellas de cemento en cochera, marcos de aluminio en color blanco, herreria en balcones."},{"$f":"_xlfn.XLOOKUP($A216,[1]Inf_general_desarrollo!$A:$A,[1]Inf_general_desarrollo!$G:$G)","v":"Yeso pulido"},{"$f":"_xlfn.XLOOKUP($A216,[1]Inf_general_desarrollo!$A:$A,[1]Inf_general_desarrollo!$I:$I)","v":"Concreto Hidráulico"}]
["Carena- Etapa 3","Horizontal","Amina",null,2,1,1,2,96,"77.4",6,"-",2,null,"-","Si","Si","-",{"$f":"_xlfn.XLOOKUP(Tabla62[[#This Row],[Nombre_desarrollo]],[1]Inf_general_desarrollo!$A:$A,[1]Inf_general_desarrollo!$C:$C)","v":"Rectificado"},{"$f":"_xlfn.XLOOKUP($A217,[1]Inf_general_desarrollo!$A:$A,[1]Inf_general_desarrollo!$D:$D)","v":"60x60"},{"$f":"_xlfn.XLOOKUP($A217,[1]Inf_general_desarrollo!$A:$A,[1]Inf_general_desarrollo!$E:$E)","v":"Barandal de herreria en escalera, yeso pulido, lavamanos sencillo, regaderas revestidas."},{"$f":"_xlfn.XLOOKUP($A217,[1]Inf_general_desarrollo!$A:$A,[1]Inf_general_desarrollo!$F:$F)","v":"Huellas de cemento en cochera, marcos de aluminio en color negro."},{"$f":"_xlfn.XLOOKUP($A217,[1]Inf_general_desarrollo!$A:$A,[1]Inf_general_desarrollo!$G:$G)","v":"Yeso pulido"},{"$f":"_xlfn.XLOOKUP($A217,[1]Inf_general_desarrollo!$A:$A,[1]Inf_general_desarrollo!$I:$I)","v":"Concreto Hidráulico"}]
["Carena- Etapa 3","Horizontal","Mara",null,2,2,1,2,96,"95.3",6,"-",2,null,"-","Si","Si","-",{"$f":"_xlfn.XLOOKUP(Tabla62[[#This Row],[Nombre_desarrollo]],[1]Inf_general_desarrollo!$A:$A,[1]Inf_general_desarrollo!$C:$C)","v":"Rectificado"},{"$f":"_xlfn.XLOOKUP($A218,[1]Inf_general_desarrollo!$A:$A,[1]Inf_general_desarrollo!$D:$D)","v":"60x60"},{"$f":"_xlfn.XLOOKUP($A218,[1]Inf_general_desarrollo!$A:$A,[1]Inf_general_desarrollo!$E:$E)","v":"Barandal de herreria en escalera, yeso pulido, lavamanos sencillo, regaderas revestidas."},{"$f":"_xlfn.XLOOKUP($A218,[1]Inf_general_desarrollo!$A:$A,[1]Inf_general_desarrollo!$F:$F)","v":"Huellas de cemento en cochera, marcos de aluminio en color negro."},{"$f":"_xlfn.XLOOKUP($A218,[1]Inf_general_desarrollo!$A:$A,[1]Inf_general_desarrollo!$G:$G)","v":"Yeso pulido"},{"$f":"_xlfn.XLOOKUP($A218,[1]Inf_general_desarrollo!$A:$A,[1]Inf_general_desarrollo!$I:$I)","v":"Concreto Hidráulico"}]
["Carena- Etapa 3","Horizontal","Alana",null,3,3,0,2,96,"100.2",6,"-",2,null,"-","Si","Si","-",{"$f":"_xlfn.XLOOKUP(Tabla62[[#This Row],[Nombre_desarrollo]],[1]Inf_general_desarrollo!$A:$A,[1]Inf_general_desarrollo!$C:$C)","v":"Rectificado"},{"$f":"_xlfn.XLOOKUP($A219,[1]Inf_general_desarrollo!$A:$A,[1]Inf_general_desarrollo!$D:$D)","v":"60x60"},{"$f":"_xlfn.XLOOKUP($A219,[1]Inf_general_desarrollo!$A:$A,[1]Inf_general_desarrollo!$E:$E)","v":"Barandal de herreria en escalera, yeso pulido, lavamanos sencillo, regaderas revestidas."},{"$f":"_xlfn.XLOOKUP($A219,[1]Inf_general_desarrollo!$A:$A,[1]Inf_general_desarrollo!$F:$F)","v":"Huellas de cemento en cochera, marcos de aluminio en color negro."},{"$f":"_xlfn.XLOOKUP($A219,[1]Inf_general_desarrollo!$A:$A,[1]Inf_general_desarrollo!$G:$G)","v":"Yeso pulido"},{"$f":"_xlfn.XLOOKUP($A219,[1]Inf_general_desarrollo!$A:$A,[1]Inf_general_desarrollo!$I:$I)","v":"Concreto Hidráulico"}]
["Carena- Etapa 3","Horizontal","Zaira",null,4,3,0,2,96,112,6,"-",2,null,"-","Si","Si","-",{"$f":"_xlfn.XLOOKUP(Tabla62[[#This Row],[Nombre_desarrollo]],[1]Inf_general_desarrollo!$A:$A,[1]Inf_general_desarrollo!$C:$C)","v":"Rectificado"},{"$f":"_xlfn.XLOOKUP($A220,[1]Inf_general_desarrollo!$A:$A,[1]Inf_general_desarrollo!$D:$D)","v":"60x60"},{"$f":"_xlfn.XLOOKUP($A220,[1]Inf_general_desarrollo!$A:$A,[1]Inf_general_desarrollo!$E:$E)","v":"Barandal de herreria en escalera, yeso pulido, lavamanos sencillo, regaderas revestidas."},{"$f":"_xlfn.XLOOKUP($A220,[1]Inf_general_desarrollo!$A:$A,[1]Inf_general_desarrollo!$F:$F)","v":"Huellas de cemento en cochera, marcos de aluminio en color negro."},{"$f":"_xlfn.XLOOKUP($A220,[1]Inf_general_desarrollo!$A:$A,[1]Inf_general_desarrollo!$G:$G)","v":"Yeso pulido"},{"$f":"_xlfn.XLOOKUP($A220,[1]Inf_general_desarrollo!$A:$A,[1]Inf_general_desarrollo!$I:$I)","v":"Concreto Hidráulico"}]
["Carena- Etapa 3","Horizontal","Everest",null,3,1,1,2,96,76,6,"-",2,null,"-","Si","Si","-",{"$f":"_xlfn.XLOOKUP(Tabla62[[#This Row],[Nombre_desarrollo]],[1]Inf_general_desarrollo!$A:$A,[1]Inf_general_desarrollo!$C:$C)","v":"Rectificado"},{"$f":"_xlfn.XLOOKUP($A221,[1]Inf_general_desarrollo!$A:$A,[1]Inf_general_desarrollo!$D:$D)","v":"60x60"},{"$f":"_xlfn.XLOOKUP($A221,[1]Inf_general_desarrollo!$A:$A,[1]Inf_general_desarrollo!$E:$E)","v":"Barandal de herreria en escalera, yeso pulido, lavamanos sencillo, regaderas revestidas."},{"$f":"_xlfn.XLOOKUP($A221,[1]Inf_general_desarrollo!$A:$A,[1]Inf_general_desarrollo!$F:$F)","v":"Huellas de cemento en cochera, marcos de aluminio en color negro."},{"$f":"_xlfn.XLOOKUP($A221,[1]Inf_general_desarrollo!$A:$A,[1]Inf_general_desarrollo!$G:$G)","v":"Yeso pulido"},{"$f":"_xlfn.XLOOKUP($A221,[1]Inf_general_desarrollo!$A:$A,[1]Inf_general_desarrollo!$I:$I)","v":"Concreto Hidráulico"}]
["Carena- Etapa 3","Horizontal","Denali",null,3,2,1,2,96,90,6,"-",2,null,"-","Si","Si","-",{"$f":"_xlfn.XLOOKUP(Tabla62[[#This Row],[Nombre_desarrollo]],[1]Inf_general_desarrollo!$A:$A,[1]Inf_general_desarrollo!$C:$C)","v":"Rectificado"},{"$f":"_xlfn.XLOOKUP($A222,[1]Inf_general_desarrollo!$A:$A,[1]Inf_general_desarrollo!$D:$D)","v":"60x60"},{"$f":"_xlfn.XLOOKUP($A222,[1]Inf_general_desarrollo!$A:$A,[1]Inf_general_desarrollo!$E:$E)","v":"Barandal de herreria en escalera, yeso pulido, lavamanos sencillo, regaderas revestidas."},{"$f":"_xlfn.XLOOKUP($A222,[1]Inf_general_desarrollo!$A:$A,[1]Inf_general_desarrollo!$F:$F)","v":"Huellas de cemento en cochera, marcos de aluminio en color negro."},{"$f":"_xlfn.XLOOKUP($A222,[1]Inf_general_desarrollo!$A:$A,[1]Inf_general_desarrollo!$G:$G)","v":"Yeso pulido"},{"$f":"_xlfn.XLOOKUP($A222,[1]Inf_general_desarrollo!$A:$A,[1]Inf_general_desarrollo!$I:$I)","v":"Concreto Hidráulico"}]
["Amura - ETAPA 2","Horizontal","Harmony",null,3,2,1,2,126,"145.47",7,"No",2,null,"Si","Si","Si","Boiler, lavadora, calentador de paso y preparación de minisplit.",{"$f":"_xlfn.XLOOKUP(Tabla62[[#This Row],[Nombre_desarrollo]],[1]Inf_general_desarrollo!$A:$A,[1]Inf_general_desarrollo!$C:$C)","v":"Cerámico"},{"$f":"_xlfn.XLOOKUP($A223,[1]Inf_general_desarrollo!$A:$A,[1]Inf_general_desarrollo!$D:$D)","v":"60x60"},{"$f":"_xlfn.XLOOKUP($A223,[1]Inf_general_desarrollo!$A:$A,[1]Inf_general_desarrollo!$E:$E)","v":"Yeso pulido en paredes, cocina de madera y melanina, pisos de recamara y escaleras loseta tipo madera y cerámico para los demás espacios."},{"$f":"_xlfn.XLOOKUP($A223,[1]Inf_general_desarrollo!$A:$A,[1]Inf_general_desarrollo!$F:$F)","v":"Vistas en piedra cantera"},{"$f":"_xlfn.XLOOKUP($A223,[1]Inf_general_desarrollo!$A:$A,[1]Inf_general_desarrollo!$G:$G)","v":"Yeso pulido"},{"$f":"_xlfn.XLOOKUP($A223,[1]Inf_general_desarrollo!$A:$A,[1]Inf_general_desarrollo!$I:$I)","v":"Concreto Hidráulico"}]
["Amura - ETAPA 2","Horizontal","Astoria",null,3,3,1,2,126,"175.35",7,"No",2,null,"Si","Si","Si","Boiler, lavadora, calentador de paso y preparación de minisplit.",{"$f":"_xlfn.XLOOKUP(Tabla62[[#This Row],[Nombre_desarrollo]],[1]Inf_general_desarrollo!$A:$A,[1]Inf_general_desarrollo!$C:$C)","v":"Cerámico"},{"$f":"_xlfn.XLOOKUP($A224,[1]Inf_general_desarrollo!$A:$A,[1]Inf_general_desarrollo!$D:$D)","v":"60x60"},{"$f":"_xlfn.XLOOKUP($A224,[1]Inf_general_desarrollo!$A:$A,[1]Inf_general_desarrollo!$E:$E)","v":"Yeso pulido en paredes, cocina de madera y melanina, pisos de recamara y escaleras loseta tipo madera y cerámico para los demás espacios."},{"$f":"_xlfn.XLOOKUP($A224,[1]Inf_general_desarrollo!$A:$A,[1]Inf_general_desarrollo!$F:$F)","v":"Vistas en piedra cantera"},{"$f":"_xlfn.XLOOKUP($A224,[1]Inf_general_desarrollo!$A:$A,[1]Inf_general_desarrollo!$G:$G)","v":"Yeso pulido"},{"$f":"_xlfn.XLOOKUP($A224,[1]Inf_general_desarrollo!$A:$A,[1]Inf_general_desarrollo!$I:$I)","v":"Concreto Hidráulico"}]
["Amura - ETAPA 2","Horizontal","Zafiro",null,4,4,1,2,126,"180.15",7,"No",2,null,"Si","Si","Si","Boiler, lavadora, calentador de paso y preparación de minisplit.",{"$f":"_xlfn.XLOOKUP(Tabla62[[#This Row],[Nombre_desarrollo]],[1]Inf_general_desarrollo!$A:$A,[1]Inf_general_desarrollo!$C:$C)","v":"Cerámico"},{"$f":"_xlfn.XLOOKUP($A225,[1]Inf_general_desarrollo!$A:$A,[1]Inf_general_desarrollo!$D:$D)","v":"60x60"},{"$f":"_xlfn.XLOOKUP($A225,[1]Inf_general_desarrollo!$A:$A,[1]Inf_general_desarrollo!$E:$E)","v":"Yeso pulido en paredes, cocina de madera y melanina, pisos de recamara y escaleras loseta tipo madera y cerámico para los demás espacios."},{"$f":"_xlfn.XLOOKUP($A225,[1]Inf_general_desarrollo!$A:$A,[1]Inf_general_desarrollo!$F:$F)","v":"Vistas en piedra cantera"},{"$f":"_xlfn.XLOOKUP($A225,[1]Inf_general_desarrollo!$A:$A,[1]Inf_general_desarrollo!$G:$G)","v":"Yeso pulido"},{"$f":"_xlfn.XLOOKUP($A225,[1]Inf_general_desarrollo!$A:$A,[1]Inf_general_desarrollo!$I:$I)","v":"Concreto Hidráulico"}]
["Amura - ETAPA 2","Horizontal","Calipso",null,3,2,0,1,126,"83.5",7,"No",2,null,"Si","Si","Si","Boiler, lavadora, calentador de paso y preparación de minisplit.",{"$f":"_xlfn.XLOOKUP(Tabla62[[#This Row],[Nombre_desarrollo]],[1]Inf_general_desarrollo!$A:$A,[1]Inf_general_desarrollo!$C:$C)","v":"Cerámico"},{"$f":"_xlfn.XLOOKUP($A226,[1]Inf_general_desarrollo!$A:$A,[1]Inf_general_desarrollo!$D:$D)","v":"60x60"},{"$f":"_xlfn.XLOOKUP($A226,[1]Inf_general_desarrollo!$A:$A,[1]Inf_general_desarrollo!$E:$E)","v":"Yeso pulido en paredes, cocina de madera y melanina, pisos de recamara y escaleras loseta tipo madera y cerámico para los demás espacios."},{"$f":"_xlfn.XLOOKUP($A226,[1]Inf_general_desarrollo!$A:$A,[1]Inf_general_desarrollo!$F:$F)","v":"Vistas en piedra cantera"},{"$f":"_xlfn.XLOOKUP($A226,[1]Inf_general_desarrollo!$A:$A,[1]Inf_general_desarrollo!$G:$G)","v":"Yeso pulido"},{"$f":"_xlfn.XLOOKUP($A226,[1]Inf_general_desarrollo!$A:$A,[1]Inf_general_desarrollo!$I:$I)","v":"Concreto Hidráulico"}]
["La Cartuja Residencial - Nueva etapa","Horizontal","Rioja",null,2,2,1,2,99,"96.68",6,"No",2,null,"Si","Si","Si","Instalaciones para lavadora, calentador de paso.",{"$f":"_xlfn.XLOOKUP(Tabla62[[#This Row],[Nombre_desarrollo]],[1]Inf_general_desarrollo!$A:$A,[1]Inf_general_desarrollo!$C:$C)","v":"Cerámico"},{"$f":"_xlfn.XLOOKUP($A227,[1]Inf_general_desarrollo!$A:$A,[1]Inf_general_desarrollo!$D:$D)","v":"60x60"},{"$f":"_xlfn.XLOOKUP($A227,[1]Inf_general_desarrollo!$A:$A,[1]Inf_general_desarrollo!$E:$E)","v":"Yeso pulido en paredes, cocina de madera, melamina, pisos en recamaras y escalera, loseta tipo madera."},{"$f":"_xlfn.XLOOKUP($A227,[1]Inf_general_desarrollo!$A:$A,[1]Inf_general_desarrollo!$F:$F)","v":"Vista en piedra o loseta tipo madera."},{"$f":"_xlfn.XLOOKUP($A227,[1]Inf_general_desarrollo!$A:$A,[1]Inf_general_desarrollo!$G:$G)","v":"Yeso pulido"},{"$f":"_xlfn.XLOOKUP($A227,[1]Inf_general_desarrollo!$A:$A,[1]Inf_general_desarrollo!$I:$I)","v":"Concreto"}]
["La Cartuja Residencial - Nueva etapa","Horizontal","Segovia",null,3,3,0,2,99,"102.66",6,"No",2,null,"Si","Si","Si","Instalaciones para lavadora, calentador de paso.",{"$f":"_xlfn.XLOOKUP(Tabla62[[#This Row],[Nombre_desarrollo]],[1]Inf_general_desarrollo!$A:$A,[1]Inf_general_desarrollo!$C:$C)","v":"Cerámico"},{"$f":"_xlfn.XLOOKUP($A228,[1]Inf_general_desarrollo!$A:$A,[1]Inf_general_desarrollo!$D:$D)","v":"60x60"},{"$f":"_xlfn.XLOOKUP($A228,[1]Inf_general_desarrollo!$A:$A,[1]Inf_general_desarrollo!$E:$E)","v":"Yeso pulido en paredes, cocina de madera, melamina, pisos en recamaras y escalera, loseta tipo madera."},{"$f":"_xlfn.XLOOKUP($A228,[1]Inf_general_desarrollo!$A:$A,[1]Inf_general_desarrollo!$F:$F)","v":"Vista en piedra o loseta tipo madera."},{"$f":"_xlfn.XLOOKUP($A228,[1]Inf_general_desarrollo!$A:$A,[1]Inf_general_desarrollo!$G:$G)","v":"Yeso pulido"},{"$f":"_xlfn.XLOOKUP($A228,[1]Inf_general_desarrollo!$A:$A,[1]Inf_general_desarrollo!$I:$I)","v":"Concreto"}]
["La Cartuja Residencial - Nueva etapa","Horizontal","Castilla",null,3,3,0,2,99,"112.6",6,"No",2,null,"Si","Si","Si","Instalaciones para lavadora, calentador de paso.",{"$f":"_xlfn.XLOOKUP(Tabla62[[#This Row],[Nombre_desarrollo]],[1]Inf_general_desarrollo!$A:$A,[1]Inf_general_desarrollo!$C:$C)","v":"Cerámico"},{"$f":"_xlfn.XLOOKUP($A229,[1]Inf_general_desarrollo!$A:$A,[1]Inf_general_desarrollo!$D:$D)","v":"60x60"},{"$f":"_xlfn.XLOOKUP($A229,[1]Inf_general_desarrollo!$A:$A,[1]Inf_general_desarrollo!$E:$E)","v":"Yeso pulido en paredes, cocina de madera, melamina, pisos en recamaras y escalera, loseta tipo madera."},{"$f":"_xlfn.XLOOKUP($A229,[1]Inf_general_desarrollo!$A:$A,[1]Inf_general_desarrollo!$F:$F)","v":"Vista en piedra o loseta tipo madera."},{"$f":"_xlfn.XLOOKUP($A229,[1]Inf_general_desarrollo!$A:$A,[1]Inf_general_desarrollo!$G:$G)","v":"Yeso pulido"},{"$f":"_xlfn.XLOOKUP($A229,[1]Inf_general_desarrollo!$A:$A,[1]Inf_general_desarrollo!$I:$I)","v":"Concreto"}]
["La Cartuja Residencial - Nueva etapa","Horizontal","Palma",null,3,3,0,2,99,"122.7",6,"No",2,null,"Si","Si","Si","Instalaciones para lavadora, calentador de paso.",{"$f":"_xlfn.XLOOKUP(Tabla62[[#This Row],[Nombre_desarrollo]],[1]Inf_general_desarrollo!$A:$A,[1]Inf_general_desarrollo!$C:$C)","v":"Cerámico"},{"$f":"_xlfn.XLOOKUP($A230,[1]Inf_general_desarrollo!$A:$A,[1]Inf_general_desarrollo!$D:$D)","v":"60x60"},{"$f":"_xlfn.XLOOKUP($A230,[1]Inf_general_desarrollo!$A:$A,[1]Inf_general_desarrollo!$E:$E)","v":"Yeso pulido en paredes, cocina de madera, melamina, pisos en recamaras y escalera, loseta tipo madera."},{"$f":"_xlfn.XLOOKUP($A230,[1]Inf_general_desarrollo!$A:$A,[1]Inf_general_desarrollo!$F:$F)","v":"Vista en piedra o loseta tipo madera."},{"$f":"_xlfn.XLOOKUP($A230,[1]Inf_general_desarrollo!$A:$A,[1]Inf_general_desarrollo!$G:$G)","v":"Yeso pulido"},{"$f":"_xlfn.XLOOKUP($A230,[1]Inf_general_desarrollo!$A:$A,[1]Inf_general_desarrollo!$I:$I)","v":"Concreto"}]
["La Cartuja Residencial - Nueva etapa","Horizontal","Cataluña",null,3,2,0,2,99,82.04,6,"No",2,null,"Si","Si","Si","Instalaciones para lavadora, calentador de paso.",{"$f":"_xlfn.XLOOKUP(Tabla62[[#This Row],[Nombre_desarrollo]],[1]Inf_general_desarrollo!$A:$A,[1]Inf_general_desarrollo!$C:$C)","v":"Cerámico"},{"$f":"_xlfn.XLOOKUP($A231,[1]Inf_general_desarrollo!$A:$A,[1]Inf_general_desarrollo!$D:$D)","v":"60x60"},{"$f":"_xlfn.XLOOKUP($A231,[1]Inf_general_desarrollo!$A:$A,[1]Inf_general_desarrollo!$E:$E)","v":"Yeso pulido en paredes, cocina de madera, melamina, pisos en recamaras y escalera, loseta tipo madera."},{"$f":"_xlfn.XLOOKUP($A231,[1]Inf_general_desarrollo!$A:$A,[1]Inf_general_desarrollo!$F:$F)","v":"Vista en piedra o loseta tipo madera."},{"$f":"_xlfn.XLOOKUP($A231,[1]Inf_general_desarrollo!$A:$A,[1]Inf_general_desarrollo!$G:$G)","v":"Yeso pulido"},{"$f":"_xlfn.XLOOKUP($A231,[1]Inf_general_desarrollo!$A:$A,[1]Inf_general_desarrollo!$I:$I)","v":"Concreto"}]
["La Cartuja Residencial - Nueva etapa","Horizontal","Bilbao",null,2,2,1,2,99,73.709999999999994,6,"No",2,null,"Si","Si","Si","Instalaciones para lavadora, calentador de paso.",{"$f":"_xlfn.XLOOKUP(Tabla62[[#This Row],[Nombre_desarrollo]],[1]Inf_general_desarrollo!$A:$A,[1]Inf_general_desarrollo!$C:$C)","v":"Cerámico"},{"$f":"_xlfn.XLOOKUP($A232,[1]Inf_general_desarrollo!$A:$A,[1]Inf_general_desarrollo!$D:$D)","v":"60x60"},{"$f":"_xlfn.XLOOKUP($A232,[1]Inf_general_desarrollo!$A:$A,[1]Inf_general_desarrollo!$E:$E)","v":"Yeso pulido en paredes, cocina de madera, melamina, pisos en recamaras y escalera, loseta tipo madera."},{"$f":"_xlfn.XLOOKUP($A232,[1]Inf_general_desarrollo!$A:$A,[1]Inf_general_desarrollo!$F:$F)","v":"Vista en piedra o loseta tipo madera."},{"$f":"_xlfn.XLOOKUP($A232,[1]Inf_general_desarrollo!$A:$A,[1]Inf_general_desarrollo!$G:$G)","v":"Yeso pulido"},{"$f":"_xlfn.XLOOKUP($A232,[1]Inf_general_desarrollo!$A:$A,[1]Inf_general_desarrollo!$I:$I)","v":"Concreto"}]
["La Cartuja Residencial - Nueva etapa","Horizontal","Victoria",null,3,2,0,2,99,95.78,6,"No",2,null,"Si","Si","Si","Instalaciones para lavadora, calentador de paso.",{"$f":"_xlfn.XLOOKUP(Tabla62[[#This Row],[Nombre_desarrollo]],[1]Inf_general_desarrollo!$A:$A,[1]Inf_general_desarrollo!$C:$C)","v":"Cerámico"},{"$f":"_xlfn.XLOOKUP($A233,[1]Inf_general_desarrollo!$A:$A,[1]Inf_general_desarrollo!$D:$D)","v":"60x60"},{"$f":"_xlfn.XLOOKUP($A233,[1]Inf_general_desarrollo!$A:$A,[1]Inf_general_desarrollo!$E:$E)","v":"Yeso pulido en paredes, cocina de madera, melamina, pisos en recamaras y escalera, loseta tipo madera."},{"$f":"_xlfn.XLOOKUP($A233,[1]Inf_general_desarrollo!$A:$A,[1]Inf_general_desarrollo!$F:$F)","v":"Vista en piedra o loseta tipo madera."},{"$f":"_xlfn.XLOOKUP($A233,[1]Inf_general_desarrollo!$A:$A,[1]Inf_general_desarrollo!$G:$G)","v":"Yeso pulido"},{"$f":"_xlfn.XLOOKUP($A233,[1]Inf_general_desarrollo!$A:$A,[1]Inf_general_desarrollo!$I:$I)","v":"Concreto"}]
["Ferrara Casas","Horizontal","Mura",null,2,2,0,2,96,"84.10",6,"No",1,null,"Si","Si","Si","Preparación para minisplit",{"$f":"_xlfn.XLOOKUP(Tabla62[[#This Row],[Nombre_desarrollo]],[1]Inf_general_desarrollo!$A:$A,[1]Inf_general_desarrollo!$C:$C)","v":"Cerámico"},{"$f":"_xlfn.XLOOKUP($A234,[1]Inf_general_desarrollo!$A:$A,[1]Inf_general_desarrollo!$D:$D)","v":"45x90"},{"$f":"_xlfn.XLOOKUP($A234,[1]Inf_general_desarrollo!$A:$A,[1]Inf_general_desarrollo!$E:$E)","v":"Puerta principal de multipanel, puerts interiores abatibles de hdf, yeso pulido en paredes, sanitario once piece, lavamanos y pedestal, regadera de plato redonda, juego de accesorios marca dica, monomando lavamanos."},{"$f":"_xlfn.XLOOKUP($A234,[1]Inf_general_desarrollo!$A:$A,[1]Inf_general_desarrollo!$F:$F)","v":"canceleria de aluminio en color negro, huellas de cemento."},{"$f":"_xlfn.XLOOKUP($A234,[1]Inf_general_desarrollo!$A:$A,[1]Inf_general_desarrollo!$G:$G)","v":"Yeso pulido"},{"$f":"_xlfn.XLOOKUP($A234,[1]Inf_general_desarrollo!$A:$A,[1]Inf_general_desarrollo!$I:$I)","v":"Concreto"}]
["Ferrara Casas","Horizontal","Vileta",null,2,3,0,2,96,"93.30",6,"No",1,null,"Si","Si","Si","Preparación para minisplit",{"$f":"_xlfn.XLOOKUP(Tabla62[[#This Row],[Nombre_desarrollo]],[1]Inf_general_desarrollo!$A:$A,[1]Inf_general_desarrollo!$C:$C)","v":"Cerámico"},{"$f":"_xlfn.XLOOKUP($A235,[1]Inf_general_desarrollo!$A:$A,[1]Inf_general_desarrollo!$D:$D)","v":"45x90"},{"$f":"_xlfn.XLOOKUP($A235,[1]Inf_general_desarrollo!$A:$A,[1]Inf_general_desarrollo!$E:$E)","v":"Puerta principal de multipanel, puerts interiores abatibles de hdf, yeso pulido en paredes, sanitario once piece, lavamanos y pedestal, regadera de plato redonda, juego de accesorios marca dica, monomando lavamanos."},{"$f":"_xlfn.XLOOKUP($A235,[1]Inf_general_desarrollo!$A:$A,[1]Inf_general_desarrollo!$F:$F)","v":"canceleria de aluminio en color negro, huellas de cemento."},{"$f":"_xlfn.XLOOKUP($A235,[1]Inf_general_desarrollo!$A:$A,[1]Inf_general_desarrollo!$G:$G)","v":"Yeso pulido"},{"$f":"_xlfn.XLOOKUP($A235,[1]Inf_general_desarrollo!$A:$A,[1]Inf_general_desarrollo!$I:$I)","v":"Concreto"}]
["Ferrara Casas","Horizontal","Dimora",null,3,3,0,2,96,"103.50",6,"No",1,null,"Si","Si","Si","Preparación para minisplit",{"$f":"_xlfn.XLOOKUP(Tabla62[[#This Row],[Nombre_desarrollo]],[1]Inf_general_desarrollo!$A:$A,[1]Inf_general_desarrollo!$C:$C)","v":"Cerámico"},{"$f":"_xlfn.XLOOKUP($A236,[1]Inf_general_desarrollo!$A:$A,[1]Inf_general_desarrollo!$D:$D)","v":"45x90"},{"$f":"_xlfn.XLOOKUP($A236,[1]Inf_general_desarrollo!$A:$A,[1]Inf_general_desarrollo!$E:$E)","v":"Puerta principal de multipanel, puerts interiores abatibles de hdf, yeso pulido en paredes, sanitario once piece, lavamanos y pedestal, regadera de plato redonda, juego de accesorios marca dica, monomando lavamanos."},{"$f":"_xlfn.XLOOKUP($A236,[1]Inf_general_desarrollo!$A:$A,[1]Inf_general_desarrollo!$F:$F)","v":"canceleria de aluminio en color negro, huellas de cemento."},{"$f":"_xlfn.XLOOKUP($A236,[1]Inf_general_desarrollo!$A:$A,[1]Inf_general_desarrollo!$G:$G)","v":"Yeso pulido"},{"$f":"_xlfn.XLOOKUP($A236,[1]Inf_general_desarrollo!$A:$A,[1]Inf_general_desarrollo!$I:$I)","v":"Concreto"}]
["Ferrara Casas","Horizontal","Castelli",null,3,4,0,2,96,"125.30",6,"No",1,null,"Si","Si","Si","Preparación para minisplit",{"$f":"_xlfn.XLOOKUP(Tabla62[[#This Row],[Nombre_desarrollo]],[1]Inf_general_desarrollo!$A:$A,[1]Inf_general_desarrollo!$C:$C)","v":"Cerámico"},{"$f":"_xlfn.XLOOKUP($A237,[1]Inf_general_desarrollo!$A:$A,[1]Inf_general_desarrollo!$D:$D)","v":"45x90"},{"$f":"_xlfn.XLOOKUP($A237,[1]Inf_general_desarrollo!$A:$A,[1]Inf_general_desarrollo!$E:$E)","v":"Puerta principal de multipanel, puerts interiores abatibles de hdf, yeso pulido en paredes, sanitario once piece, lavamanos y pedestal, regadera de plato redonda, juego de accesorios marca dica, monomando lavamanos."},{"$f":"_xlfn.XLOOKUP($A237,[1]Inf_general_desarrollo!$A:$A,[1]Inf_general_desarrollo!$F:$F)","v":"canceleria de aluminio en color negro, huellas de cemento."},{"$f":"_xlfn.XLOOKUP($A237,[1]Inf_general_desarrollo!$A:$A,[1]Inf_general_desarrollo!$G:$G)","v":"Yeso pulido"},{"$f":"_xlfn.XLOOKUP($A237,[1]Inf_general_desarrollo!$A:$A,[1]Inf_general_desarrollo!$I:$I)","v":"Concreto"}]
["Ferrara Casas","Horizontal","Everest",null,3,1,1,2,96,76,6,"No",1,null,"Si","Si","Si","Preparación para minisplit",{"$f":"_xlfn.XLOOKUP(Tabla62[[#This Row],[Nombre_desarrollo]],[1]Inf_general_desarrollo!$A:$A,[1]Inf_general_desarrollo!$C:$C)","v":"Cerámico"},{"$f":"_xlfn.XLOOKUP($A238,[1]Inf_general_desarrollo!$A:$A,[1]Inf_general_desarrollo!$D:$D)","v":"45x90"},{"$f":"_xlfn.XLOOKUP($A238,[1]Inf_general_desarrollo!$A:$A,[1]Inf_general_desarrollo!$E:$E)","v":"Puerta principal de multipanel, puerts interiores abatibles de hdf, yeso pulido en paredes, sanitario once piece, lavamanos y pedestal, regadera de plato redonda, juego de accesorios marca dica, monomando lavamanos."},{"$f":"_xlfn.XLOOKUP($A238,[1]Inf_general_desarrollo!$A:$A,[1]Inf_general_desarrollo!$F:$F)","v":"canceleria de aluminio en color negro, huellas de cemento."},{"$f":"_xlfn.XLOOKUP($A238,[1]Inf_general_desarrollo!$A:$A,[1]Inf_general_desarrollo!$G:$G)","v":"Yeso pulido"},{"$f":"_xlfn.XLOOKUP($A238,[1]Inf_general_desarrollo!$A:$A,[1]Inf_general_desarrollo!$I:$I)","v":"Concreto"}]
["Ferrara Casas","Horizontal","Denali",null,3,2,1,2,96,90,6,"No",1,null,"Si","Si","Si","Preparación para minisplit",{"$f":"_xlfn.XLOOKUP(Tabla62[[#This Row],[Nombre_desarrollo]],[1]Inf_general_desarrollo!$A:$A,[1]Inf_general_desarrollo!$C:$C)","v":"Cerámico"},{"$f":"_xlfn.XLOOKUP($A239,[1]Inf_general_desarrollo!$A:$A,[1]Inf_general_desarrollo!$D:$D)","v":"45x90"},{"$f":"_xlfn.XLOOKUP($A239,[1]Inf_general_desarrollo!$A:$A,[1]Inf_general_desarrollo!$E:$E)","v":"Puerta principal de multipanel, puerts interiores abatibles de hdf, yeso pulido en paredes, sanitario once piece, lavamanos y pedestal, regadera de plato redonda, juego de accesorios marca dica, monomando lavamanos."},{"$f":"_xlfn.XLOOKUP($A239,[1]Inf_general_desarrollo!$A:$A,[1]Inf_general_desarrollo!$F:$F)","v":"canceleria de aluminio en color negro, huellas de cemento."},{"$f":"_xlfn.XLOOKUP($A239,[1]Inf_general_desarrollo!$A:$A,[1]Inf_general_desarrollo!$G:$G)","v":"Yeso pulido"},{"$f":"_xlfn.XLOOKUP($A239,[1]Inf_general_desarrollo!$A:$A,[1]Inf_general_desarrollo!$I:$I)","v":"Concreto"}]
["Zekkei Residencial","Horizontal","Zafiro",null,3,2,1,2,120,126,"2023-05-06","No",2,null,"Si","Si","Si","-",{"$f":"_xlfn.XLOOKUP(Tabla62[[#This Row],[Nombre_desarrollo]],[1]Inf_general_desarrollo!$A:$A,[1]Inf_general_desarrollo!$C:$C)","v":"Cerámico"},{"$f":"_xlfn.XLOOKUP($A240,[1]Inf_general_desarrollo!$A:$A,[1]Inf_general_desarrollo!$D:$D)","v":"60x60"},{"$f":"_xlfn.XLOOKUP($A240,[1]Inf_general_desarrollo!$A:$A,[1]Inf_general_desarrollo!$E:$E)","v":"Paredes texturizadas, mosquitero, puertas tipo madera, ovalin en baño sobre una placa de azulejo, regaderas revestidas en azulejo,"},{"$f":"_xlfn.XLOOKUP($A240,[1]Inf_general_desarrollo!$A:$A,[1]Inf_general_desarrollo!$F:$F)","v":"Concreto en cochera."},{"$f":"_xlfn.XLOOKUP($A240,[1]Inf_general_desarrollo!$A:$A,[1]Inf_general_desarrollo!$G:$G)","v":"Texturizada"},{"$f":"_xlfn.XLOOKUP($A240,[1]Inf_general_desarrollo!$A:$A,[1]Inf_general_desarrollo!$I:$I)","v":"Concreto"}]
["Porta Arvena","Horizontal","Lavanda",null,3,2,1,2,"115.5","118.26",7,"No",2,null,"Si","Si","Si","preparacion para a/a",{"$f":"_xlfn.XLOOKUP(Tabla62[[#This Row],[Nombre_desarrollo]],[1]Inf_general_desarrollo!$A:$A,[1]Inf_general_desarrollo!$C:$C)","v":"Cerámico"},{"$f":"_xlfn.XLOOKUP($A241,[1]Inf_general_desarrollo!$A:$A,[1]Inf_general_desarrollo!$D:$D)","v":"60x60"},{"$f":"_xlfn.XLOOKUP($A241,[1]Inf_general_desarrollo!$A:$A,[1]Inf_general_desarrollo!$E:$E)","v":"Accesorios de baño, paredes en yeso."},{"$f":"_xlfn.XLOOKUP($A241,[1]Inf_general_desarrollo!$A:$A,[1]Inf_general_desarrollo!$F:$F)","v":"Huellas de cemento en cochera"},{"$f":"_xlfn.XLOOKUP($A241,[1]Inf_general_desarrollo!$A:$A,[1]Inf_general_desarrollo!$G:$G)","v":"Yeso pulido"},{"$f":"_xlfn.XLOOKUP($A241,[1]Inf_general_desarrollo!$A:$A,[1]Inf_general_desarrollo!$I:$I)","v":"Concreto"}]
["Porta Arvena","Horizontal","Verbena",null,3,3,0,2,"115.5","130.45",7,"No",2,null,"Si","Si","Si","preparacion para a/a",{"$f":"_xlfn.XLOOKUP(Tabla62[[#This Row],[Nombre_desarrollo]],[1]Inf_general_desarrollo!$A:$A,[1]Inf_general_desarrollo!$C:$C)","v":"Cerámico"},{"$f":"_xlfn.XLOOKUP($A242,[1]Inf_general_desarrollo!$A:$A,[1]Inf_general_desarrollo!$D:$D)","v":"60x60"},{"$f":"_xlfn.XLOOKUP($A242,[1]Inf_general_desarrollo!$A:$A,[1]Inf_general_desarrollo!$E:$E)","v":"Accesorios de baño, paredes en yeso."},{"$f":"_xlfn.XLOOKUP($A242,[1]Inf_general_desarrollo!$A:$A,[1]Inf_general_desarrollo!$F:$F)","v":"Huellas de cemento en cochera"},{"$f":"_xlfn.XLOOKUP($A242,[1]Inf_general_desarrollo!$A:$A,[1]Inf_general_desarrollo!$G:$G)","v":"Yeso pulido"},{"$f":"_xlfn.XLOOKUP($A242,[1]Inf_general_desarrollo!$A:$A,[1]Inf_general_desarrollo!$I:$I)","v":"Concreto"}]
["Porta Arvena","Horizontal","Magnolia",null,3,2,1,2,"115.5","151.92",7,"No",2,null,"Si","Si","Si","preparacion para a/a",{"$f":"_xlfn.XLOOKUP(Tabla62[[#This Row],[Nombre_desarrollo]],[1]Inf_general_desarrollo!$A:$A,[1]Inf_general_desarrollo!$C:$C)","v":"Cerámico"},{"$f":"_xlfn.XLOOKUP($A243,[1]Inf_general_desarrollo!$A:$A,[1]Inf_general_desarrollo!$D:$D)","v":"60x60"},{"$f":"_xlfn.XLOOKUP($A243,[1]Inf_general_desarrollo!$A:$A,[1]Inf_general_desarrollo!$E:$E)","v":"Accesorios de baño, paredes en yeso."},{"$f":"_xlfn.XLOOKUP($A243,[1]Inf_general_desarrollo!$A:$A,[1]Inf_general_desarrollo!$F:$F)","v":"Huellas de cemento en cochera"},{"$f":"_xlfn.XLOOKUP($A243,[1]Inf_general_desarrollo!$A:$A,[1]Inf_general_desarrollo!$G:$G)","v":"Yeso pulido"},{"$f":"_xlfn.XLOOKUP($A243,[1]Inf_general_desarrollo!$A:$A,[1]Inf_general_desarrollo!$I:$I)","v":"Concreto"}]
["Luzia Residencial","Horizontal","Aura",null,2,2,1,2,96,"99.5",6,"No",2,null,"Si","Si","Si","preparacion para a/a",{"$f":"_xlfn.XLOOKUP(Tabla62[[#This Row],[Nombre_desarrollo]],[1]Inf_general_desarrollo!$A:$A,[1]Inf_general_desarrollo!$C:$C)","v":"Cerámico"},{"$f":"_xlfn.XLOOKUP($A244,[1]Inf_general_desarrollo!$A:$A,[1]Inf_general_desarrollo!$D:$D)","v":"60x60"},{"$f":"_xlfn.XLOOKUP($A244,[1]Inf_general_desarrollo!$A:$A,[1]Inf_general_desarrollo!$E:$E)","v":"Enyesado pulido, cocina de madera, granito pisos cerámicos."},{"$f":"_xlfn.XLOOKUP($A244,[1]Inf_general_desarrollo!$A:$A,[1]Inf_general_desarrollo!$F:$F)","v":"Vistas en piedra galarza y tipo madera."},{"$f":"_xlfn.XLOOKUP($A244,[1]Inf_general_desarrollo!$A:$A,[1]Inf_general_desarrollo!$G:$G)","v":"Yeso pulido"},{"$f":"_xlfn.XLOOKUP($A244,[1]Inf_general_desarrollo!$A:$A,[1]Inf_general_desarrollo!$I:$I)","v":"Concreto"}]
["Luzia Residencial","Horizontal","Boreal",null,3,2,1,2,96,"108.5",6,"No",2,null,"Si","Si","Si","preparacion para a/a",{"$f":"_xlfn.XLOOKUP(Tabla62[[#This Row],[Nombre_desarrollo]],[1]Inf_general_desarrollo!$A:$A,[1]Inf_general_desarrollo!$C:$C)","v":"Cerámico"},{"$f":"_xlfn.XLOOKUP($A245,[1]Inf_general_desarrollo!$A:$A,[1]Inf_general_desarrollo!$D:$D)","v":"60x60"},{"$f":"_xlfn.XLOOKUP($A245,[1]Inf_general_desarrollo!$A:$A,[1]Inf_general_desarrollo!$E:$E)","v":"Enyesado pulido, cocina de madera, granito pisos cerámicos."},{"$f":"_xlfn.XLOOKUP($A245,[1]Inf_general_desarrollo!$A:$A,[1]Inf_general_desarrollo!$F:$F)","v":"Vistas en piedra galarza y tipo madera."},{"$f":"_xlfn.XLOOKUP($A245,[1]Inf_general_desarrollo!$A:$A,[1]Inf_general_desarrollo!$G:$G)","v":"Yeso pulido"},{"$f":"_xlfn.XLOOKUP($A245,[1]Inf_general_desarrollo!$A:$A,[1]Inf_general_desarrollo!$I:$I)","v":"Concreto"}]
["Luzia Residencial","Horizontal","Centella",null,3,3,0,2,96,"126.3",6,"No",2,null,"Si","Si","Si","preparacion para a/a",{"$f":"_xlfn.XLOOKUP(Tabla62[[#This Row],[Nombre_desarrollo]],[1]Inf_general_desarrollo!$A:$A,[1]Inf_general_desarrollo!$C:$C)","v":"Cerámico"},{"$f":"_xlfn.XLOOKUP($A246,[1]Inf_general_desarrollo!$A:$A,[1]Inf_general_desarrollo!$D:$D)","v":"60x60"},{"$f":"_xlfn.XLOOKUP($A246,[1]Inf_general_desarrollo!$A:$A,[1]Inf_general_desarrollo!$E:$E)","v":"Enyesado pulido, cocina de madera, granito pisos cerámicos."},{"$f":"_xlfn.XLOOKUP($A246,[1]Inf_general_desarrollo!$A:$A,[1]Inf_general_desarrollo!$F:$F)","v":"Vistas en piedra galarza y tipo madera."},{"$f":"_xlfn.XLOOKUP($A246,[1]Inf_general_desarrollo!$A:$A,[1]Inf_general_desarrollo!$G:$G)","v":"Yeso pulido"},{"$f":"_xlfn.XLOOKUP($A246,[1]Inf_general_desarrollo!$A:$A,[1]Inf_general_desarrollo!$I:$I)","v":"Concreto"}]
["Luzia Residencial","Horizontal","Destello",null,3,2,1,2,96,"152.5",6,"No",2,null,"Si","Si","Si","preparacion para a/a",{"$f":"_xlfn.XLOOKUP(Tabla62[[#This Row],[Nombre_desarrollo]],[1]Inf_general_desarrollo!$A:$A,[1]Inf_general_desarrollo!$C:$C)","v":"Cerámico"},{"$f":"_xlfn.XLOOKUP($A247,[1]Inf_general_desarrollo!$A:$A,[1]Inf_general_desarrollo!$D:$D)","v":"60x60"},{"$f":"_xlfn.XLOOKUP($A247,[1]Inf_general_desarrollo!$A:$A,[1]Inf_general_desarrollo!$E:$E)","v":"Enyesado pulido, cocina de madera, granito pisos cerámicos."},{"$f":"_xlfn.XLOOKUP($A247,[1]Inf_general_desarrollo!$A:$A,[1]Inf_general_desarrollo!$F:$F)","v":"Vistas en piedra galarza y tipo madera."},{"$f":"_xlfn.XLOOKUP($A247,[1]Inf_general_desarrollo!$A:$A,[1]Inf_general_desarrollo!$G:$G)","v":"Yeso pulido"},{"$f":"_xlfn.XLOOKUP($A247,[1]Inf_general_desarrollo!$A:$A,[1]Inf_general_desarrollo!$I:$I)","v":"Concreto"}]
["Luzia Residencial","Horizontal","Destello Plus",null,3,2,2,3,96,"174.1",6,"No",2,null,"Si","Si","Si","preparacion para a/a",{"$f":"_xlfn.XLOOKUP(Tabla62[[#This Row],[Nombre_desarrollo]],[1]Inf_general_desarrollo!$A:$A,[1]Inf_general_desarrollo!$C:$C)","v":"Cerámico"},{"$f":"_xlfn.XLOOKUP($A248,[1]Inf_general_desarrollo!$A:$A,[1]Inf_general_desarrollo!$D:$D)","v":"60x60"},{"$f":"_xlfn.XLOOKUP($A248,[1]Inf_general_desarrollo!$A:$A,[1]Inf_general_desarrollo!$E:$E)","v":"Enyesado pulido, cocina de madera, granito pisos cerámicos."},{"$f":"_xlfn.XLOOKUP($A248,[1]Inf_general_desarrollo!$A:$A,[1]Inf_general_desarrollo!$F:$F)","v":"Vistas en piedra galarza y tipo madera."},{"$f":"_xlfn.XLOOKUP($A248,[1]Inf_general_desarrollo!$A:$A,[1]Inf_general_desarrollo!$G:$G)","v":"Yeso pulido"},{"$f":"_xlfn.XLOOKUP($A248,[1]Inf_general_desarrollo!$A:$A,[1]Inf_general_desarrollo!$I:$I)","v":"Concreto"}]
["La Perla Norte- NUEVA ETAPA","Horizontal","Agata",null,3,3,0,2,135,"171.3","2024-05-07","No",2,null,"Si","Si","Si","Instalación para lavadora, secadora, minisplit.",{"$f":"_xlfn.XLOOKUP(Tabla62[[#This Row],[Nombre_desarrollo]],[1]Inf_general_desarrollo!$A:$A,[1]Inf_general_desarrollo!$C:$C)","v":"Cerámico"},{"$f":"_xlfn.XLOOKUP($A249,[1]Inf_general_desarrollo!$A:$A,[1]Inf_general_desarrollo!$D:$D)","v":"60x60"},{"$f":"_xlfn.XLOOKUP($A249,[1]Inf_general_desarrollo!$A:$A,[1]Inf_general_desarrollo!$E:$E)","v":"Yeso pulido, mármol, granito, paneles cerámicos de relieve."},{"$f":"_xlfn.XLOOKUP($A249,[1]Inf_general_desarrollo!$A:$A,[1]Inf_general_desarrollo!$F:$F)","v":"Yeso pulido y cantera."},{"$f":"_xlfn.XLOOKUP($A249,[1]Inf_general_desarrollo!$A:$A,[1]Inf_general_desarrollo!$G:$G)","v":"Yeso pulido"},{"$f":"_xlfn.XLOOKUP($A249,[1]Inf_general_desarrollo!$A:$A,[1]Inf_general_desarrollo!$I:$I)","v":"Concreto Hidráulico"}]
["La Perla Norte- NUEVA ETAPA","Horizontal","Granate",null,3,3,0,2,135,"195.5","2024-05-07","No",2,null,"Si","Si","Si","Instalación para lavadora, secadora, minisplit.",{"$f":"_xlfn.XLOOKUP(Tabla62[[#This Row],[Nombre_desarrollo]],[1]Inf_general_desarrollo!$A:$A,[1]Inf_general_desarrollo!$C:$C)","v":"Cerámico"},{"$f":"_xlfn.XLOOKUP($A250,[1]Inf_general_desarrollo!$A:$A,[1]Inf_general_desarrollo!$D:$D)","v":"60x60"},{"$f":"_xlfn.XLOOKUP($A250,[1]Inf_general_desarrollo!$A:$A,[1]Inf_general_desarrollo!$E:$E)","v":"Yeso pulido, mármol, granito, paneles cerámicos de relieve."},{"$f":"_xlfn.XLOOKUP($A250,[1]Inf_general_desarrollo!$A:$A,[1]Inf_general_desarrollo!$F:$F)","v":"Yeso pulido y cantera."},{"$f":"_xlfn.XLOOKUP($A250,[1]Inf_general_desarrollo!$A:$A,[1]Inf_general_desarrollo!$G:$G)","v":"Yeso pulido"},{"$f":"_xlfn.XLOOKUP($A250,[1]Inf_general_desarrollo!$A:$A,[1]Inf_general_desarrollo!$I:$I)","v":"Concreto Hidráulico"}]
["La Perla Norte- NUEVA ETAPA","Horizontal","Opalo",null,3,3,0,2,135,"203.6","2024-05-07","No",2,null,"Si","Si","Si","Instalación para lavadora, secadora, minisplit.",{"$f":"_xlfn.XLOOKUP(Tabla62[[#This Row],[Nombre_desarrollo]],[1]Inf_general_desarrollo!$A:$A,[1]Inf_general_desarrollo!$C:$C)","v":"Cerámico"},{"$f":"_xlfn.XLOOKUP($A251,[1]Inf_general_desarrollo!$A:$A,[1]Inf_general_desarrollo!$D:$D)","v":"60x60"},{"$f":"_xlfn.XLOOKUP($A251,[1]Inf_general_desarrollo!$A:$A,[1]Inf_general_desarrollo!$E:$E)","v":"Yeso pulido, mármol, granito, paneles cerámicos de relieve."},{"$f":"_xlfn.XLOOKUP($A251,[1]Inf_general_desarrollo!$A:$A,[1]Inf_general_desarrollo!$F:$F)","v":"Yeso pulido y cantera."},{"$f":"_xlfn.XLOOKUP($A251,[1]Inf_general_desarrollo!$A:$A,[1]Inf_general_desarrollo!$G:$G)","v":"Yeso pulido"},{"$f":"_xlfn.XLOOKUP($A251,[1]Inf_general_desarrollo!$A:$A,[1]Inf_general_desarrollo!$I:$I)","v":"Concreto Hidráulico"}]
["La Perla Norte- NUEVA ETAPA","Horizontal","Jade",null,4,3,1,2,135,"209.6","2024-05-07","No",2,null,"Si","Si","Si","Instalación para lavadora, secadora, minisplit.",{"$f":"_xlfn.XLOOKUP(Tabla62[[#This Row],[Nombre_desarrollo]],[1]Inf_general_desarrollo!$A:$A,[1]Inf_general_desarrollo!$C:$C)","v":"Cerámico"},{"$f":"_xlfn.XLOOKUP($A252,[1]Inf_general_desarrollo!$A:$A,[1]Inf_general_desarrollo!$D:$D)","v":"60x60"},{"$f":"_xlfn.XLOOKUP($A252,[1]Inf_general_desarrollo!$A:$A,[1]Inf_general_desarrollo!$E:$E)","v":"Yeso pulido, mármol, granito, paneles cerámicos de relieve."},{"$f":"_xlfn.XLOOKUP($A252,[1]Inf_general_desarrollo!$A:$A,[1]Inf_general_desarrollo!$F:$F)","v":"Yeso pulido y cantera."},{"$f":"_xlfn.XLOOKUP($A252,[1]Inf_general_desarrollo!$A:$A,[1]Inf_general_desarrollo!$G:$G)","v":"Yeso pulido"},{"$f":"_xlfn.XLOOKUP($A252,[1]Inf_general_desarrollo!$A:$A,[1]Inf_general_desarrollo!$I:$I)","v":"Concreto Hidráulico"}]
["La Perla Norte- NUEVA ETAPA","Horizontal","Circon",null,4,3,1,2,135,"238.4","2024-05-07","No",2,null,"Si","Si","Si","Instalación para lavadora, secadora, minisplit.",{"$f":"_xlfn.XLOOKUP(Tabla62[[#This Row],[Nombre_desarrollo]],[1]Inf_general_desarrollo!$A:$A,[1]Inf_general_desarrollo!$C:$C)","v":"Cerámico"},{"$f":"_xlfn.XLOOKUP($A253,[1]Inf_general_desarrollo!$A:$A,[1]Inf_general_desarrollo!$D:$D)","v":"60x60"},{"$f":"_xlfn.XLOOKUP($A253,[1]Inf_general_desarrollo!$A:$A,[1]Inf_general_desarrollo!$E:$E)","v":"Yeso pulido, mármol, granito, paneles cerámicos de relieve."},{"$f":"_xlfn.XLOOKUP($A253,[1]Inf_general_desarrollo!$A:$A,[1]Inf_general_desarrollo!$F:$F)","v":"Yeso pulido y cantera."},{"$f":"_xlfn.XLOOKUP($A253,[1]Inf_general_desarrollo!$A:$A,[1]Inf_general_desarrollo!$G:$G)","v":"Yeso pulido"},{"$f":"_xlfn.XLOOKUP($A253,[1]Inf_general_desarrollo!$A:$A,[1]Inf_general_desarrollo!$I:$I)","v":"Concreto Hidráulico"}]
["La Perla Norte- NUEVA ETAPA","Horizontal","Azurita",null,3,3,0,2,135,170.5,"2024-05-07","No",2,null,"Si","Si","Si","Instalación para lavadora, secadora, minisplit.",{"$f":"_xlfn.XLOOKUP(Tabla62[[#This Row],[Nombre_desarrollo]],[1]Inf_general_desarrollo!$A:$A,[1]Inf_general_desarrollo!$C:$C)","v":"Cerámico"},{"$f":"_xlfn.XLOOKUP($A254,[1]Inf_general_desarrollo!$A:$A,[1]Inf_general_desarrollo!$D:$D)","v":"60x60"},{"$f":"_xlfn.XLOOKUP($A254,[1]Inf_general_desarrollo!$A:$A,[1]Inf_general_desarrollo!$E:$E)","v":"Yeso pulido, mármol, granito, paneles cerámicos de relieve."},{"$f":"_xlfn.XLOOKUP($A254,[1]Inf_general_desarrollo!$A:$A,[1]Inf_general_desarrollo!$F:$F)","v":"Yeso pulido y cantera."},{"$f":"_xlfn.XLOOKUP($A254,[1]Inf_general_desarrollo!$A:$A,[1]Inf_general_desarrollo!$G:$G)","v":"Yeso pulido"},{"$f":"_xlfn.XLOOKUP($A254,[1]Inf_general_desarrollo!$A:$A,[1]Inf_general_desarrollo!$I:$I)","v":"Concreto Hidráulico"}]
["La Perla Norte- NUEVA ETAPA","Horizontal","Jaspe",null,3,3,1,2,135,193.6,"2024-05-07","No",2,null,"Si","Si","Si","Instalación para lavadora, secadora, minisplit.",{"$f":"_xlfn.XLOOKUP(Tabla62[[#This Row],[Nombre_desarrollo]],[1]Inf_general_desarrollo!$A:$A,[1]Inf_general_desarrollo!$C:$C)","v":"Cerámico"},{"$f":"_xlfn.XLOOKUP($A255,[1]Inf_general_desarrollo!$A:$A,[1]Inf_general_desarrollo!$D:$D)","v":"60x60"},{"$f":"_xlfn.XLOOKUP($A255,[1]Inf_general_desarrollo!$A:$A,[1]Inf_general_desarrollo!$E:$E)","v":"Yeso pulido, mármol, granito, paneles cerámicos de relieve."},{"$f":"_xlfn.XLOOKUP($A255,[1]Inf_general_desarrollo!$A:$A,[1]Inf_general_desarrollo!$F:$F)","v":"Yeso pulido y cantera."},{"$f":"_xlfn.XLOOKUP($A255,[1]Inf_general_desarrollo!$A:$A,[1]Inf_general_desarrollo!$G:$G)","v":"Yeso pulido"},{"$f":"_xlfn.XLOOKUP($A255,[1]Inf_general_desarrollo!$A:$A,[1]Inf_general_desarrollo!$I:$I)","v":"Concreto Hidráulico"}]
["Zekkei Residencial II","Horizontal","Malaga",null,3,2,1,2,96,108,"2024-01-06","No",2,null,"Si","Si","Si","preparacion para a/a",{"$f":"_xlfn.XLOOKUP(Tabla62[[#This Row],[Nombre_desarrollo]],[1]Inf_general_desarrollo!$A:$A,[1]Inf_general_desarrollo!$C:$C)","v":{"$error":"#N/A"}},{"$f":"_xlfn.XLOOKUP($A256,[1]Inf_general_desarrollo!$A:$A,[1]Inf_general_desarrollo!$D:$D)","v":{"$error":"#N/A"}},{"$f":"_xlfn.XLOOKUP($A256,[1]Inf_general_desarrollo!$A:$A,[1]Inf_general_desarrollo!$E:$E)","v":{"$error":"#N/A"}},{"$f":"_xlfn.XLOOKUP($A256,[1]Inf_general_desarrollo!$A:$A,[1]Inf_general_desarrollo!$F:$F)","v":{"$error":"#N/A"}},{"$f":"_xlfn.XLOOKUP($A256,[1]Inf_general_desarrollo!$A:$A,[1]Inf_general_desarrollo!$G:$G)","v":{"$error":"#N/A"}},{"$f":"_xlfn.XLOOKUP($A256,[1]Inf_general_desarrollo!$A:$A,[1]Inf_general_desarrollo!$I:$I)","v":{"$error":"#N/A"}}]
["Zekkei Residencial II","Horizontal","Zafiro",null,3,2,1,2,120,126,"2024-05-06","No",2,null,"Si","Si","Si","preparacion para a/a",{"$f":"_xlfn.XLOOKUP(Tabla62[[#This Row],[Nombre_desarrollo]],[1]Inf_general_desarrollo!$A:$A,[1]Inf_general_desarrollo!$C:$C)","v":{"$error":"#N/A"}},{"$f":"_xlfn.XLOOKUP($A257,[1]Inf_general_desarrollo!$A:$A,[1]Inf_general_desarrollo!$D:$D)","v":{"$error":"#N/A"}},{"$f":"_xlfn.XLOOKUP($A257,[1]Inf_general_desarrollo!$A:$A,[1]Inf_general_desarrollo!$E:$E)","v":{"$error":"#N/A"}},{"$f":"_xlfn.XLOOKUP($A257,[1]Inf_general_desarrollo!$A:$A,[1]Inf_general_desarrollo!$F:$F)","v":{"$error":"#N/A"}},{"$f":"_xlfn.XLOOKUP($A257,[1]Inf_general_desarrollo!$A:$A,[1]Inf_general_desarrollo!$G:$G)","v":{"$error":"#N/A"}},{"$f":"_xlfn.XLOOKUP($A257,[1]Inf_general_desarrollo!$A:$A,[1]Inf_general_desarrollo!$I:$I)","v":{"$error":"#N/A"}}]
["Tamara Residencial","Horizontal","Olivo",null,3,2,1,2,126,139,6,"No",2,null,"Si","Si","Si","preparacion para a/a",{"$f":"_xlfn.XLOOKUP(Tabla62[[#This Row],[Nombre_desarrollo]],[1]Inf_general_desarrollo!$A:$A,[1]Inf_general_desarrollo!$C:$C)","v":"Cerámico"},{"$f":"_xlfn.XLOOKUP($A258,[1]Inf_general_desarrollo!$A:$A,[1]Inf_general_desarrollo!$D:$D)","v":"55x55"},{"$f":"_xlfn.XLOOKUP($A258,[1]Inf_general_desarrollo!$A:$A,[1]Inf_general_desarrollo!$E:$E)","v":"Yeso pulido, closets de madera, cocina con acabados en granito, piso cerámico."},{"$f":"_xlfn.XLOOKUP($A258,[1]Inf_general_desarrollo!$A:$A,[1]Inf_general_desarrollo!$F:$F)","v":"Yeso pulido"},{"$f":"_xlfn.XLOOKUP($A258,[1]Inf_general_desarrollo!$A:$A,[1]Inf_general_desarrollo!$G:$G)","v":"Yeso pulido"},{"$f":"_xlfn.XLOOKUP($A258,[1]Inf_general_desarrollo!$A:$A,[1]Inf_general_desarrollo!$I:$I)","v":"Concreto Hidráulico"}]
["Tamara Residencial","Horizontal","Fresno",null,2,2,1,2,126,162,6,"No",2,null,"Si","Si","Si","preparacion para a/a",{"$f":"_xlfn.XLOOKUP(Tabla62[[#This Row],[Nombre_desarrollo]],[1]Inf_general_desarrollo!$A:$A,[1]Inf_general_desarrollo!$C:$C)","v":"Cerámico"},{"$f":"_xlfn.XLOOKUP($A259,[1]Inf_general_desarrollo!$A:$A,[1]Inf_general_desarrollo!$D:$D)","v":"55x55"},{"$f":"_xlfn.XLOOKUP($A259,[1]Inf_general_desarrollo!$A:$A,[1]Inf_general_desarrollo!$E:$E)","v":"Yeso pulido, closets de madera, cocina con acabados en granito, piso cerámico."},{"$f":"_xlfn.XLOOKUP($A259,[1]Inf_general_desarrollo!$A:$A,[1]Inf_general_desarrollo!$F:$F)","v":"Yeso pulido"},{"$f":"_xlfn.XLOOKUP($A259,[1]Inf_general_desarrollo!$A:$A,[1]Inf_general_desarrollo!$G:$G)","v":"Yeso pulido"},{"$f":"_xlfn.XLOOKUP($A259,[1]Inf_general_desarrollo!$A:$A,[1]Inf_general_desarrollo!$I:$I)","v":"Concreto Hidráulico"}]
["Tamara Residencial","Horizontal","Olivo plus",null,3,3,1,3,126,169,6,"No",2,null,"Si","Si","Si","preparacion para a/a",{"$f":"_xlfn.XLOOKUP(Tabla62[[#This Row],[Nombre_desarrollo]],[1]Inf_general_desarrollo!$A:$A,[1]Inf_general_desarrollo!$C:$C)","v":"Cerámico"},{"$f":"_xlfn.XLOOKUP($A260,[1]Inf_general_desarrollo!$A:$A,[1]Inf_general_desarrollo!$D:$D)","v":"55x55"},{"$f":"_xlfn.XLOOKUP($A260,[1]Inf_general_desarrollo!$A:$A,[1]Inf_general_desarrollo!$E:$E)","v":"Yeso pulido, closets de madera, cocina con acabados en granito, piso cerámico."},{"$f":"_xlfn.XLOOKUP($A260,[1]Inf_general_desarrollo!$A:$A,[1]Inf_general_desarrollo!$F:$F)","v":"Yeso pulido"},{"$f":"_xlfn.XLOOKUP($A260,[1]Inf_general_desarrollo!$A:$A,[1]Inf_general_desarrollo!$G:$G)","v":"Yeso pulido"},{"$f":"_xlfn.XLOOKUP($A260,[1]Inf_general_desarrollo!$A:$A,[1]Inf_general_desarrollo!$I:$I)","v":"Concreto Hidráulico"}]
["Arroyo San Emilion","Horizontal","Cabernet",null,3,3,1,2,90,"113.97","-","No",2,null,"Si","Si","Si",null,{"$f":"_xlfn.XLOOKUP(Tabla62[[#This Row],[Nombre_desarrollo]],[1]Inf_general_desarrollo!$A:$A,[1]Inf_general_desarrollo!$C:$C)","v":"Cerámico"},{"$f":"_xlfn.XLOOKUP($A261,[1]Inf_general_desarrollo!$A:$A,[1]Inf_general_desarrollo!$D:$D)","v":"60x60"},{"$f":"_xlfn.XLOOKUP($A261,[1]Inf_general_desarrollo!$A:$A,[1]Inf_general_desarrollo!$E:$E)","v":"Yeso pulido en paredes, cocina de madera con acabados en granito, base de marmol con muebles de madera en baños."},{"$f":"_xlfn.XLOOKUP($A261,[1]Inf_general_desarrollo!$A:$A,[1]Inf_general_desarrollo!$F:$F)","v":"Vistas en piedra galarza y tipo madera."},{"$f":"_xlfn.XLOOKUP($A261,[1]Inf_general_desarrollo!$A:$A,[1]Inf_general_desarrollo!$G:$G)","v":"Yeso pulido"},{"$f":"_xlfn.XLOOKUP($A261,[1]Inf_general_desarrollo!$A:$A,[1]Inf_general_desarrollo!$I:$I)","v":"Concreto"}]
["Arroyo San Emilion","Horizontal","Merlot",null,3,2,1,2,90,"135.51","-","No",2,null,"Si","Si","Si",null,{"$f":"_xlfn.XLOOKUP(Tabla62[[#This Row],[Nombre_desarrollo]],[1]Inf_general_desarrollo!$A:$A,[1]Inf_general_desarrollo!$C:$C)","v":"Cerámico"},{"$f":"_xlfn.XLOOKUP($A262,[1]Inf_general_desarrollo!$A:$A,[1]Inf_general_desarrollo!$D:$D)","v":"60x60"},{"$f":"_xlfn.XLOOKUP($A262,[1]Inf_general_desarrollo!$A:$A,[1]Inf_general_desarrollo!$E:$E)","v":"Yeso pulido en paredes, cocina de madera con acabados en granito, base de marmol con muebles de madera en baños."},{"$f":"_xlfn.XLOOKUP($A262,[1]Inf_general_desarrollo!$A:$A,[1]Inf_general_desarrollo!$F:$F)","v":"Vistas en piedra galarza y tipo madera."},{"$f":"_xlfn.XLOOKUP($A262,[1]Inf_general_desarrollo!$A:$A,[1]Inf_general_desarrollo!$G:$G)","v":"Yeso pulido"},{"$f":"_xlfn.XLOOKUP($A262,[1]Inf_general_desarrollo!$A:$A,[1]Inf_general_desarrollo!$I:$I)","v":"Concreto"}]
["Arroyo San Emilion","Horizontal","Petro plus",null,4,2,2,3,90,"175.57","-","No",2,null,"Si","si","Si",null,{"$f":"_xlfn.XLOOKUP(Tabla62[[#This Row],[Nombre_desarrollo]],[1]Inf_general_desarrollo!$A:$A,[1]Inf_general_desarrollo!$C:$C)","v":"Cerámico"},{"$f":"_xlfn.XLOOKUP($A263,[1]Inf_general_desarrollo!$A:$A,[1]Inf_general_desarrollo!$D:$D)","v":"60x60"},{"$f":"_xlfn.XLOOKUP($A263,[1]Inf_general_desarrollo!$A:$A,[1]Inf_general_desarrollo!$E:$E)","v":"Yeso pulido en paredes, cocina de madera con acabados en granito, base de marmol con muebles de madera en baños."},{"$f":"_xlfn.XLOOKUP($A263,[1]Inf_general_desarrollo!$A:$A,[1]Inf_general_desarrollo!$F:$F)","v":"Vistas en piedra galarza y tipo madera."},{"$f":"_xlfn.XLOOKUP($A263,[1]Inf_general_desarrollo!$A:$A,[1]Inf_general_desarrollo!$G:$G)","v":"Yeso pulido"},{"$f":"_xlfn.XLOOKUP($A263,[1]Inf_general_desarrollo!$A:$A,[1]Inf_general_desarrollo!$I:$I)","v":"Concreto"}]
["Abada Residencial","Horizontal","Brun",null,3,2,0,1,112,"104.79",7,"No",1,null,"Si","Si","Si",null,{"$f":"_xlfn.XLOOKUP(Tabla62[[#This Row],[Nombre_desarrollo]],[1]Inf_general_desarrollo!$A:$A,[1]Inf_general_desarrollo!$C:$C)","v":"Cerámico"},{"$f":"_xlfn.XLOOKUP($A264,[1]Inf_general_desarrollo!$A:$A,[1]Inf_general_desarrollo!$D:$D)","v":"60x60"},{"$f":"_xlfn.XLOOKUP($A264,[1]Inf_general_desarrollo!$A:$A,[1]Inf_general_desarrollo!$E:$E)","v":"yeso pulido, cocina de madera y granito, pisos cerámicos."},{"$f":"_xlfn.XLOOKUP($A264,[1]Inf_general_desarrollo!$A:$A,[1]Inf_general_desarrollo!$F:$F)","v":"Muros con detalles de loseta tipo madera, herreria en cochera"},{"$f":"_xlfn.XLOOKUP($A264,[1]Inf_general_desarrollo!$A:$A,[1]Inf_general_desarrollo!$G:$G)","v":"Yeso pulido"},{"$f":"_xlfn.XLOOKUP($A264,[1]Inf_general_desarrollo!$A:$A,[1]Inf_general_desarrollo!$I:$I)","v":"Concreto"}]
["Abada Residencial","Horizontal","Ocre",null,3,3,1,2,112,"156.7",7,"No",2,null,"Si","Si","Si",null,{"$f":"_xlfn.XLOOKUP(Tabla62[[#This Row],[Nombre_desarrollo]],[1]Inf_general_desarrollo!$A:$A,[1]Inf_general_desarrollo!$C:$C)","v":"Cerámico"},{"$f":"_xlfn.XLOOKUP($A265,[1]Inf_general_desarrollo!$A:$A,[1]Inf_general_desarrollo!$D:$D)","v":"60x60"},{"$f":"_xlfn.XLOOKUP($A265,[1]Inf_general_desarrollo!$A:$A,[1]Inf_general_desarrollo!$E:$E)","v":"yeso pulido, cocina de madera y granito, pisos cerámicos."},{"$f":"_xlfn.XLOOKUP($A265,[1]Inf_general_desarrollo!$A:$A,[1]Inf_general_desarrollo!$F:$F)","v":"Muros con detalles de loseta tipo madera, herreria en cochera"},{"$f":"_xlfn.XLOOKUP($A265,[1]Inf_general_desarrollo!$A:$A,[1]Inf_general_desarrollo!$G:$G)","v":"Yeso pulido"},{"$f":"_xlfn.XLOOKUP($A265,[1]Inf_general_desarrollo!$A:$A,[1]Inf_general_desarrollo!$I:$I)","v":"Concreto"}]
["Abada Residencial","Horizontal","Sepia",null,3,2,1,2,112,"160.3",7,"No",2,null,"Si","Si","Si",null,{"$f":"_xlfn.XLOOKUP(Tabla62[[#This Row],[Nombre_desarrollo]],[1]Inf_general_desarrollo!$A:$A,[1]Inf_general_desarrollo!$C:$C)","v":"Cerámico"},{"$f":"_xlfn.XLOOKUP($A266,[1]Inf_general_desarrollo!$A:$A,[1]Inf_general_desarrollo!$D:$D)","v":"60x60"},{"$f":"_xlfn.XLOOKUP($A266,[1]Inf_general_desarrollo!$A:$A,[1]Inf_general_desarrollo!$E:$E)","v":"yeso pulido, cocina de madera y granito, pisos cerámicos."},{"$f":"_xlfn.XLOOKUP($A266,[1]Inf_general_desarrollo!$A:$A,[1]Inf_general_desarrollo!$F:$F)","v":"Muros con detalles de loseta tipo madera, herreria en cochera"},{"$f":"_xlfn.XLOOKUP($A266,[1]Inf_general_desarrollo!$A:$A,[1]Inf_general_desarrollo!$G:$G)","v":"Yeso pulido"},{"$f":"_xlfn.XLOOKUP($A266,[1]Inf_general_desarrollo!$A:$A,[1]Inf_general_desarrollo!$I:$I)","v":"Concreto"}]
["Cantelli Coto Granito","Horizontal","Escarlata_1",null,2,3,0,2,96,"90.22",6,"No",2,null,"Si","Si","Si",null,{"$f":"_xlfn.XLOOKUP(Tabla62[[#This Row],[Nombre_desarrollo]],[1]Inf_general_desarrollo!$A:$A,[1]Inf_general_desarrollo!$C:$C)","v":"Cerámico"},{"$f":"_xlfn.XLOOKUP($A267,[1]Inf_general_desarrollo!$A:$A,[1]Inf_general_desarrollo!$D:$D)","v":"45x65"},{"$f":"_xlfn.XLOOKUP($A267,[1]Inf_general_desarrollo!$A:$A,[1]Inf_general_desarrollo!$E:$E)","v":"Cocina con acabados en granito, paredes en yeso pulido, esquinas boleadas, accesorios de baño."},{"$f":"_xlfn.XLOOKUP($A267,[1]Inf_general_desarrollo!$A:$A,[1]Inf_general_desarrollo!$F:$F)","v":"Vistas cerámicas imitación madera, huellas de cemento en cochera."},{"$f":"_xlfn.XLOOKUP($A267,[1]Inf_general_desarrollo!$A:$A,[1]Inf_general_desarrollo!$G:$G)","v":"Yeso pulido"},{"$f":"_xlfn.XLOOKUP($A267,[1]Inf_general_desarrollo!$A:$A,[1]Inf_general_desarrollo!$I:$I)","v":"Concreto"}]
["Cantelli Coto Granito","Horizontal","Escarlata_2",null,3,3,0,2,96,"91.1",6,"No",2,null,"Si","Si","Si",null,{"$f":"_xlfn.XLOOKUP(Tabla62[[#This Row],[Nombre_desarrollo]],[1]Inf_general_desarrollo!$A:$A,[1]Inf_general_desarrollo!$C:$C)","v":"Cerámico"},{"$f":"_xlfn.XLOOKUP($A268,[1]Inf_general_desarrollo!$A:$A,[1]Inf_general_desarrollo!$D:$D)","v":"45x65"},{"$f":"_xlfn.XLOOKUP($A268,[1]Inf_general_desarrollo!$A:$A,[1]Inf_general_desarrollo!$E:$E)","v":"Cocina con acabados en granito, paredes en yeso pulido, esquinas boleadas, accesorios de baño."},{"$f":"_xlfn.XLOOKUP($A268,[1]Inf_general_desarrollo!$A:$A,[1]Inf_general_desarrollo!$F:$F)","v":"Vistas cerámicas imitación madera, huellas de cemento en cochera."},{"$f":"_xlfn.XLOOKUP($A268,[1]Inf_general_desarrollo!$A:$A,[1]Inf_general_desarrollo!$G:$G)","v":"Yeso pulido"},{"$f":"_xlfn.XLOOKUP($A268,[1]Inf_general_desarrollo!$A:$A,[1]Inf_general_desarrollo!$I:$I)","v":"Concreto"}]
["Cantelli Coto Granito","Horizontal","Ocre",null,3,2,1,2,96,"113.34",6,"No",2,null,"Si","si","Si",null,{"$f":"_xlfn.XLOOKUP(Tabla62[[#This Row],[Nombre_desarrollo]],[1]Inf_general_desarrollo!$A:$A,[1]Inf_general_desarrollo!$C:$C)","v":"Cerámico"},{"$f":"_xlfn.XLOOKUP($A269,[1]Inf_general_desarrollo!$A:$A,[1]Inf_general_desarrollo!$D:$D)","v":"45x65"},{"$f":"_xlfn.XLOOKUP($A269,[1]Inf_general_desarrollo!$A:$A,[1]Inf_general_desarrollo!$E:$E)","v":"Cocina con acabados en granito, paredes en yeso pulido, esquinas boleadas, accesorios de baño."},{"$f":"_xlfn.XLOOKUP($A269,[1]Inf_general_desarrollo!$A:$A,[1]Inf_general_desarrollo!$F:$F)","v":"Vistas cerámicas imitación madera, huellas de cemento en cochera."},{"$f":"_xlfn.XLOOKUP($A269,[1]Inf_general_desarrollo!$A:$A,[1]Inf_general_desarrollo!$G:$G)","v":"Yeso pulido"},{"$f":"_xlfn.XLOOKUP($A269,[1]Inf_general_desarrollo!$A:$A,[1]Inf_general_desarrollo!$I:$I)","v":"Concreto"}]
["Cantelli Coto Granito","Horizontal","Arena",null,3,3,1,3,96,"144.69",6,"No",2,null,"Si","Si","Si",null,{"$f":"_xlfn.XLOOKUP(Tabla62[[#This Row],[Nombre_desarrollo]],[1]Inf_general_desarrollo!$A:$A,[1]Inf_general_desarrollo!$C:$C)","v":"Cerámico"},{"$f":"_xlfn.XLOOKUP($A270,[1]Inf_general_desarrollo!$A:$A,[1]Inf_general_desarrollo!$D:$D)","v":"45x65"},{"$f":"_xlfn.XLOOKUP($A270,[1]Inf_general_desarrollo!$A:$A,[1]Inf_general_desarrollo!$E:$E)","v":"Cocina con acabados en granito, paredes en yeso pulido, esquinas boleadas, accesorios de baño."},{"$f":"_xlfn.XLOOKUP($A270,[1]Inf_general_desarrollo!$A:$A,[1]Inf_general_desarrollo!$F:$F)","v":"Vistas cerámicas imitación madera, huellas de cemento en cochera."},{"$f":"_xlfn.XLOOKUP($A270,[1]Inf_general_desarrollo!$A:$A,[1]Inf_general_desarrollo!$G:$G)","v":"Yeso pulido"},{"$f":"_xlfn.XLOOKUP($A270,[1]Inf_general_desarrollo!$A:$A,[1]Inf_general_desarrollo!$I:$I)","v":"Concreto"}]
["Gran reserva Los Angeles","Horizontal","Andrea",null,3,2,1,2,90,"104.68",6,"No",2,null,"Si","Si","Si","-",{"$f":"_xlfn.XLOOKUP(Tabla62[[#This Row],[Nombre_desarrollo]],[1]Inf_general_desarrollo!$A:$A,[1]Inf_general_desarrollo!$C:$C)","v":"Cerámico"},{"$f":"_xlfn.XLOOKUP($A271,[1]Inf_general_desarrollo!$A:$A,[1]Inf_general_desarrollo!$D:$D)","v":"55x55"},{"$f":"_xlfn.XLOOKUP($A271,[1]Inf_general_desarrollo!$A:$A,[1]Inf_general_desarrollo!$E:$E)","v":"Yeso pulido, closets de madera, cocina con acabados en granito, piso cerámico."},{"$f":"_xlfn.XLOOKUP($A271,[1]Inf_general_desarrollo!$A:$A,[1]Inf_general_desarrollo!$F:$F)","v":"Yeso pulido"},{"$f":"_xlfn.XLOOKUP($A271,[1]Inf_general_desarrollo!$A:$A,[1]Inf_general_desarrollo!$G:$G)","v":"Yeso pulido"},{"$f":"_xlfn.XLOOKUP($A271,[1]Inf_general_desarrollo!$A:$A,[1]Inf_general_desarrollo!$I:$I)","v":"Concreto Hidráulico"}]
["Gran reserva Los Angeles","Horizontal","Denisse",null,4,2,0,2,90,"83.64",6,"No",2,null,"Si","Si","Si","-",{"$f":"_xlfn.XLOOKUP(Tabla62[[#This Row],[Nombre_desarrollo]],[1]Inf_general_desarrollo!$A:$A,[1]Inf_general_desarrollo!$C:$C)","v":"Cerámico"},{"$f":"_xlfn.XLOOKUP($A272,[1]Inf_general_desarrollo!$A:$A,[1]Inf_general_desarrollo!$D:$D)","v":"55x55"},{"$f":"_xlfn.XLOOKUP($A272,[1]Inf_general_desarrollo!$A:$A,[1]Inf_general_desarrollo!$E:$E)","v":"Yeso pulido, closets de madera, cocina con acabados en granito, piso cerámico."},{"$f":"_xlfn.XLOOKUP($A272,[1]Inf_general_desarrollo!$A:$A,[1]Inf_general_desarrollo!$F:$F)","v":"Yeso pulido"},{"$f":"_xlfn.XLOOKUP($A272,[1]Inf_general_desarrollo!$A:$A,[1]Inf_general_desarrollo!$G:$G)","v":"Yeso pulido"},{"$f":"_xlfn.XLOOKUP($A272,[1]Inf_general_desarrollo!$A:$A,[1]Inf_general_desarrollo!$I:$I)","v":"Concreto Hidráulico"}]
["Gran reserva Los Angeles","Horizontal","Ivanna",null,2,1,1,2,90,65,6,"No",2,null,"Si","si","Si","-",{"$f":"_xlfn.XLOOKUP(Tabla62[[#This Row],[Nombre_desarrollo]],[1]Inf_general_desarrollo!$A:$A,[1]Inf_general_desarrollo!$C:$C)","v":"Cerámico"},{"$f":"_xlfn.XLOOKUP($A273,[1]Inf_general_desarrollo!$A:$A,[1]Inf_general_desarrollo!$D:$D)","v":"55x55"},{"$f":"_xlfn.XLOOKUP($A273,[1]Inf_general_desarrollo!$A:$A,[1]Inf_general_desarrollo!$E:$E)","v":"Yeso pulido, closets de madera, cocina con acabados en granito, piso cerámico."},{"$f":"_xlfn.XLOOKUP($A273,[1]Inf_general_desarrollo!$A:$A,[1]Inf_general_desarrollo!$F:$F)","v":"Yeso pulido"},{"$f":"_xlfn.XLOOKUP($A273,[1]Inf_general_desarrollo!$A:$A,[1]Inf_general_desarrollo!$G:$G)","v":"Yeso pulido"},{"$f":"_xlfn.XLOOKUP($A273,[1]Inf_general_desarrollo!$A:$A,[1]Inf_general_desarrollo!$I:$I)","v":"Concreto Hidráulico"}]
["Marengo","Horizontal","M1",null,2,3,0,2,112.5,129,6,"Si",2,null,"Si","Si","Si","minsplit, boiler",{"$f":"_xlfn.XLOOKUP(Tabla62[[#This Row],[Nombre_desarrollo]],[1]Inf_general_desarrollo!$A:$A,[1]Inf_general_desarrollo!$C:$C)","v":"Cerámico"},{"$f":"_xlfn.XLOOKUP($A274,[1]Inf_general_desarrollo!$A:$A,[1]Inf_general_desarrollo!$D:$D)","v":"60x60"},{"$f":"_xlfn.XLOOKUP($A274,[1]Inf_general_desarrollo!$A:$A,[1]Inf_general_desarrollo!$E:$E)","v":"yeso pulido, cocina de madera y granito, pisos cerámicos."},{"$f":"_xlfn.XLOOKUP($A274,[1]Inf_general_desarrollo!$A:$A,[1]Inf_general_desarrollo!$F:$F)","v":"Muros con detalles de loseta tipo madera, herreria en cochera"},{"$f":"_xlfn.XLOOKUP($A274,[1]Inf_general_desarrollo!$A:$A,[1]Inf_general_desarrollo!$G:$G)","v":"Yeso pulido"},{"$f":"_xlfn.XLOOKUP($A274,[1]Inf_general_desarrollo!$A:$A,[1]Inf_general_desarrollo!$I:$I)","v":"Concreto"}]
["Marengo","Horizontal","M2",null,2,2,1,2,112.5,143,6,"Si",2,null,"Si","Si","Si","minsplit, boiler",{"$f":"_xlfn.XLOOKUP(Tabla62[[#This Row],[Nombre_desarrollo]],[1]Inf_general_desarrollo!$A:$A,[1]Inf_general_desarrollo!$C:$C)","v":"Cerámico"},{"$f":"_xlfn.XLOOKUP($A275,[1]Inf_general_desarrollo!$A:$A,[1]Inf_general_desarrollo!$D:$D)","v":"60x60"},{"$f":"_xlfn.XLOOKUP($A275,[1]Inf_general_desarrollo!$A:$A,[1]Inf_general_desarrollo!$E:$E)","v":"yeso pulido, cocina de madera y granito, pisos cerámicos."},{"$f":"_xlfn.XLOOKUP($A275,[1]Inf_general_desarrollo!$A:$A,[1]Inf_general_desarrollo!$F:$F)","v":"Muros con detalles de loseta tipo madera, herreria en cochera"},{"$f":"_xlfn.XLOOKUP($A275,[1]Inf_general_desarrollo!$A:$A,[1]Inf_general_desarrollo!$G:$G)","v":"Yeso pulido"},{"$f":"_xlfn.XLOOKUP($A275,[1]Inf_general_desarrollo!$A:$A,[1]Inf_general_desarrollo!$I:$I)","v":"Concreto"}]
["Marengo","Horizontal","M3",null,3,4,0,2,112.5,158,6,"Si",2,null,"Si","Si","Si","minsplit, boiler",{"$f":"_xlfn.XLOOKUP(Tabla62[[#This Row],[Nombre_desarrollo]],[1]Inf_general_desarrollo!$A:$A,[1]Inf_general_desarrollo!$C:$C)","v":"Cerámico"},{"$f":"_xlfn.XLOOKUP($A276,[1]Inf_general_desarrollo!$A:$A,[1]Inf_general_desarrollo!$D:$D)","v":"60x60"},{"$f":"_xlfn.XLOOKUP($A276,[1]Inf_general_desarrollo!$A:$A,[1]Inf_general_desarrollo!$E:$E)","v":"yeso pulido, cocina de madera y granito, pisos cerámicos."},{"$f":"_xlfn.XLOOKUP($A276,[1]Inf_general_desarrollo!$A:$A,[1]Inf_general_desarrollo!$F:$F)","v":"Muros con detalles de loseta tipo madera, herreria en cochera"},{"$f":"_xlfn.XLOOKUP($A276,[1]Inf_general_desarrollo!$A:$A,[1]Inf_general_desarrollo!$G:$G)","v":"Yeso pulido"},{"$f":"_xlfn.XLOOKUP($A276,[1]Inf_general_desarrollo!$A:$A,[1]Inf_general_desarrollo!$I:$I)","v":"Concreto"}]
["Kerarta Residencial","Horizontal","Munguia",null,3,3,3,2,105,104.07,7,null,2,null,"Si","Si","Si","Preparación para minisplit.",{"$f":"_xlfn.XLOOKUP(Tabla62[[#This Row],[Nombre_desarrollo]],[1]Inf_general_desarrollo!$A:$A,[1]Inf_general_desarrollo!$C:$C)","v":"Cerámico"},{"$f":"_xlfn.XLOOKUP($A277,[1]Inf_general_desarrollo!$A:$A,[1]Inf_general_desarrollo!$D:$D)","v":"60x60"},{"$f":"_xlfn.XLOOKUP($A277,[1]Inf_general_desarrollo!$A:$A,[1]Inf_general_desarrollo!$E:$E)","v":"Enyesado pulido, cocina de madera, granito pisos cerámicos."},{"$f":"_xlfn.XLOOKUP($A277,[1]Inf_general_desarrollo!$A:$A,[1]Inf_general_desarrollo!$F:$F)","v":"Vistas en losetatipo madera."},{"$f":"_xlfn.XLOOKUP($A277,[1]Inf_general_desarrollo!$A:$A,[1]Inf_general_desarrollo!$G:$G)","v":"Yeso pulido"},{"$f":"_xlfn.XLOOKUP($A277,[1]Inf_general_desarrollo!$A:$A,[1]Inf_general_desarrollo!$I:$I)","v":"Concreto"}]
["Kerarta Residencial","Horizontal","Navarra",null,3,2,0,2,105,120.58,7,null,2,null,"Si","Si","Si","Preparación para minisplit.",{"$f":"_xlfn.XLOOKUP(Tabla62[[#This Row],[Nombre_desarrollo]],[1]Inf_general_desarrollo!$A:$A,[1]Inf_general_desarrollo!$C:$C)","v":"Cerámico"},{"$f":"_xlfn.XLOOKUP($A278,[1]Inf_general_desarrollo!$A:$A,[1]Inf_general_desarrollo!$D:$D)","v":"60x60"},{"$f":"_xlfn.XLOOKUP($A278,[1]Inf_general_desarrollo!$A:$A,[1]Inf_general_desarrollo!$E:$E)","v":"Enyesado pulido, cocina de madera, granito pisos cerámicos."},{"$f":"_xlfn.XLOOKUP($A278,[1]Inf_general_desarrollo!$A:$A,[1]Inf_general_desarrollo!$F:$F)","v":"Vistas en losetatipo madera."},{"$f":"_xlfn.XLOOKUP($A278,[1]Inf_general_desarrollo!$A:$A,[1]Inf_general_desarrollo!$G:$G)","v":"Yeso pulido"},{"$f":"_xlfn.XLOOKUP($A278,[1]Inf_general_desarrollo!$A:$A,[1]Inf_general_desarrollo!$I:$I)","v":"Concreto"}]
["Kerarta Residencial","Horizontal","Vasco",null,3,2,1,2,105,136.16,7,null,2,null,"Si","Si","Si","Preparación para minisplit.",{"$f":"_xlfn.XLOOKUP(Tabla62[[#This Row],[Nombre_desarrollo]],[1]Inf_general_desarrollo!$A:$A,[1]Inf_general_desarrollo!$C:$C)","v":"Cerámico"},{"$f":"_xlfn.XLOOKUP($A279,[1]Inf_general_desarrollo!$A:$A,[1]Inf_general_desarrollo!$D:$D)","v":"60x60"},{"$f":"_xlfn.XLOOKUP($A279,[1]Inf_general_desarrollo!$A:$A,[1]Inf_general_desarrollo!$E:$E)","v":"Enyesado pulido, cocina de madera, granito pisos cerámicos."},{"$f":"_xlfn.XLOOKUP($A279,[1]Inf_general_desarrollo!$A:$A,[1]Inf_general_desarrollo!$F:$F)","v":"Vistas en losetatipo madera."},{"$f":"_xlfn.XLOOKUP($A279,[1]Inf_general_desarrollo!$A:$A,[1]Inf_general_desarrollo!$G:$G)","v":"Yeso pulido"},{"$f":"_xlfn.XLOOKUP($A279,[1]Inf_general_desarrollo!$A:$A,[1]Inf_general_desarrollo!$I:$I)","v":"Concreto"}]
["Almena Residencial Casas","Horizontal","Saetara",null,2,2,1,2,116,108,null,"No",2,null,"Si","Si","Si","Preparación para minisplit.",{"$f":"_xlfn.XLOOKUP(Tabla62[[#This Row],[Nombre_desarrollo]],[1]Inf_general_desarrollo!$A:$A,[1]Inf_general_desarrollo!$C:$C)","v":"Cerámico"},{"$f":"_xlfn.XLOOKUP($A280,[1]Inf_general_desarrollo!$A:$A,[1]Inf_general_desarrollo!$D:$D)","v":"60x60"},{"$f":"_xlfn.XLOOKUP($A280,[1]Inf_general_desarrollo!$A:$A,[1]Inf_general_desarrollo!$E:$E)","v":"Enyesado pulido, cocina de madera, granito pisos cerámicos."},{"$f":"_xlfn.XLOOKUP($A280,[1]Inf_general_desarrollo!$A:$A,[1]Inf_general_desarrollo!$F:$F)","v":"Vistas en piedra galarza y tipo madera."},{"$f":"_xlfn.XLOOKUP($A280,[1]Inf_general_desarrollo!$A:$A,[1]Inf_general_desarrollo!$G:$G)","v":"Yeso pulido"},{"$f":"_xlfn.XLOOKUP($A280,[1]Inf_general_desarrollo!$A:$A,[1]Inf_general_desarrollo!$I:$I)","v":"Concreto"}]
["Almena Residencial Casas","Horizontal","Atalaya",null,3,2,1,2,116,137,null,"No",2,null,"Si","Si","Si","Preparación para minisplit.",{"$f":"_xlfn.XLOOKUP(Tabla62[[#This Row],[Nombre_desarrollo]],[1]Inf_general_desarrollo!$A:$A,[1]Inf_general_desarrollo!$C:$C)","v":"Cerámico"},{"$f":"_xlfn.XLOOKUP($A281,[1]Inf_general_desarrollo!$A:$A,[1]Inf_general_desarrollo!$D:$D)","v":"60x60"},{"$f":"_xlfn.XLOOKUP($A281,[1]Inf_general_desarrollo!$A:$A,[1]Inf_general_desarrollo!$E:$E)","v":"Enyesado pulido, cocina de madera, granito pisos cerámicos."},{"$f":"_xlfn.XLOOKUP($A281,[1]Inf_general_desarrollo!$A:$A,[1]Inf_general_desarrollo!$F:$F)","v":"Vistas en piedra galarza y tipo madera."},{"$f":"_xlfn.XLOOKUP($A281,[1]Inf_general_desarrollo!$A:$A,[1]Inf_general_desarrollo!$G:$G)","v":"Yeso pulido"},{"$f":"_xlfn.XLOOKUP($A281,[1]Inf_general_desarrollo!$A:$A,[1]Inf_general_desarrollo!$I:$I)","v":"Concreto"}]
["Almena Residencial Casas","Horizontal","Adarve",null,3,2,1,2,116,157,null,"No",2,null,"Si","Si","Si","Preparación para minisplit.",{"$f":"_xlfn.XLOOKUP(Tabla62[[#This Row],[Nombre_desarrollo]],[1]Inf_general_desarrollo!$A:$A,[1]Inf_general_desarrollo!$C:$C)","v":"Cerámico"},{"$f":"_xlfn.XLOOKUP($A282,[1]Inf_general_desarrollo!$A:$A,[1]Inf_general_desarrollo!$D:$D)","v":"60x60"},{"$f":"_xlfn.XLOOKUP($A282,[1]Inf_general_desarrollo!$A:$A,[1]Inf_general_desarrollo!$E:$E)","v":"Enyesado pulido, cocina de madera, granito pisos cerámicos."},{"$f":"_xlfn.XLOOKUP($A282,[1]Inf_general_desarrollo!$A:$A,[1]Inf_general_desarrollo!$F:$F)","v":"Vistas en piedra galarza y tipo madera."},{"$f":"_xlfn.XLOOKUP($A282,[1]Inf_general_desarrollo!$A:$A,[1]Inf_general_desarrollo!$G:$G)","v":"Yeso pulido"},{"$f":"_xlfn.XLOOKUP($A282,[1]Inf_general_desarrollo!$A:$A,[1]Inf_general_desarrollo!$I:$I)","v":"Concreto"}]
["Almena Residencial Casas","Horizontal","Alcazar",null,3,3,1,2,116,183,null,"No",2,null,"Si","Si","Si","Preparación para minisplit.",{"$f":"_xlfn.XLOOKUP(Tabla62[[#This Row],[Nombre_desarrollo]],[1]Inf_general_desarrollo!$A:$A,[1]Inf_general_desarrollo!$C:$C)","v":"Cerámico"},{"$f":"_xlfn.XLOOKUP($A283,[1]Inf_general_desarrollo!$A:$A,[1]Inf_general_desarrollo!$D:$D)","v":"60x60"},{"$f":"_xlfn.XLOOKUP($A283,[1]Inf_general_desarrollo!$A:$A,[1]Inf_general_desarrollo!$E:$E)","v":"Enyesado pulido, cocina de madera, granito pisos cerámicos."},{"$f":"_xlfn.XLOOKUP($A283,[1]Inf_general_desarrollo!$A:$A,[1]Inf_general_desarrollo!$F:$F)","v":"Vistas en piedra galarza y tipo madera."},{"$f":"_xlfn.XLOOKUP($A283,[1]Inf_general_desarrollo!$A:$A,[1]Inf_general_desarrollo!$G:$G)","v":"Yeso pulido"},{"$f":"_xlfn.XLOOKUP($A283,[1]Inf_general_desarrollo!$A:$A,[1]Inf_general_desarrollo!$I:$I)","v":"Concreto"}]
["Almena Residencial Casas","Horizontal","Frotaleza",null,3,3,2,3,139,223,null,"No",2,null,"Si","Si","Si","Preparación para minisplit.",{"$f":"_xlfn.XLOOKUP(Tabla62[[#This Row],[Nombre_desarrollo]],[1]Inf_general_desarrollo!$A:$A,[1]Inf_general_desarrollo!$C:$C)","v":"Cerámico"},{"$f":"_xlfn.XLOOKUP($A284,[1]Inf_general_desarrollo!$A:$A,[1]Inf_general_desarrollo!$D:$D)","v":"60x60"},{"$f":"_xlfn.XLOOKUP($A284,[1]Inf_general_desarrollo!$A:$A,[1]Inf_general_desarrollo!$E:$E)","v":"Enyesado pulido, cocina de madera, granito pisos cerámicos."},{"$f":"_xlfn.XLOOKUP($A284,[1]Inf_general_desarrollo!$A:$A,[1]Inf_general_desarrollo!$F:$F)","v":"Vistas en piedra galarza y tipo madera."},{"$f":"_xlfn.XLOOKUP($A284,[1]Inf_general_desarrollo!$A:$A,[1]Inf_general_desarrollo!$G:$G)","v":"Yeso pulido"},{"$f":"_xlfn.XLOOKUP($A284,[1]Inf_general_desarrollo!$A:$A,[1]Inf_general_desarrollo!$I:$I)","v":"Concreto"}]
["Albaserrada","Horizontal","Valencia",null,2,2,0,1,135,94,null,"No",2,null,"Si","Si","Si","Preparación para minisplit.",{"$f":"_xlfn.XLOOKUP(Tabla62[[#This Row],[Nombre_desarrollo]],[1]Inf_general_desarrollo!$A:$A,[1]Inf_general_desarrollo!$C:$C)","v":"Cerámico"},{"$f":"_xlfn.XLOOKUP($A285,[1]Inf_general_desarrollo!$A:$A,[1]Inf_general_desarrollo!$D:$D)","v":"60x60"},{"$f":"_xlfn.XLOOKUP($A285,[1]Inf_general_desarrollo!$A:$A,[1]Inf_general_desarrollo!$E:$E)","v":"Enyesado pulido, cocina de madera, granito pisos cerámicos."},{"$f":"_xlfn.XLOOKUP($A285,[1]Inf_general_desarrollo!$A:$A,[1]Inf_general_desarrollo!$F:$F)","v":"Vistas en piedra tipo cantera"},{"$f":"_xlfn.XLOOKUP($A285,[1]Inf_general_desarrollo!$A:$A,[1]Inf_general_desarrollo!$G:$G)","v":"Yeso pulido"},{"$f":"_xlfn.XLOOKUP($A285,[1]Inf_general_desarrollo!$A:$A,[1]Inf_general_desarrollo!$I:$I)","v":"Concreto"}]
["Albaserrada","Horizontal","Cordoba",null,2,2,1,2,135,132.5,null,"No",2,null,"Si","Si","Si","Preparación para minisplit.",{"$f":"_xlfn.XLOOKUP(Tabla62[[#This Row],[Nombre_desarrollo]],[1]Inf_general_desarrollo!$A:$A,[1]Inf_general_desarrollo!$C:$C)","v":"Cerámico"},{"$f":"_xlfn.XLOOKUP($A286,[1]Inf_general_desarrollo!$A:$A,[1]Inf_general_desarrollo!$D:$D)","v":"60x60"},{"$f":"_xlfn.XLOOKUP($A286,[1]Inf_general_desarrollo!$A:$A,[1]Inf_general_desarrollo!$E:$E)","v":"Enyesado pulido, cocina de madera, granito pisos cerámicos."},{"$f":"_xlfn.XLOOKUP($A286,[1]Inf_general_desarrollo!$A:$A,[1]Inf_general_desarrollo!$F:$F)","v":"Vistas en piedra tipo cantera"},{"$f":"_xlfn.XLOOKUP($A286,[1]Inf_general_desarrollo!$A:$A,[1]Inf_general_desarrollo!$G:$G)","v":"Yeso pulido"},{"$f":"_xlfn.XLOOKUP($A286,[1]Inf_general_desarrollo!$A:$A,[1]Inf_general_desarrollo!$I:$I)","v":"Concreto"}]
["Albaserrada","Horizontal","Castellon",null,4,3,0,2,135,155.86000000000001,null,"No",2,null,"Si","Si","Si","Preparación para minisplit.",{"$f":"_xlfn.XLOOKUP(Tabla62[[#This Row],[Nombre_desarrollo]],[1]Inf_general_desarrollo!$A:$A,[1]Inf_general_desarrollo!$C:$C)","v":"Cerámico"},{"$f":"_xlfn.XLOOKUP($A287,[1]Inf_general_desarrollo!$A:$A,[1]Inf_general_desarrollo!$D:$D)","v":"60x60"},{"$f":"_xlfn.XLOOKUP($A287,[1]Inf_general_desarrollo!$A:$A,[1]Inf_general_desarrollo!$E:$E)","v":"Enyesado pulido, cocina de madera, granito pisos cerámicos."},{"$f":"_xlfn.XLOOKUP($A287,[1]Inf_general_desarrollo!$A:$A,[1]Inf_general_desarrollo!$F:$F)","v":"Vistas en piedra tipo cantera"},{"$f":"_xlfn.XLOOKUP($A287,[1]Inf_general_desarrollo!$A:$A,[1]Inf_general_desarrollo!$G:$G)","v":"Yeso pulido"},{"$f":"_xlfn.XLOOKUP($A287,[1]Inf_general_desarrollo!$A:$A,[1]Inf_general_desarrollo!$I:$I)","v":"Concreto"}]
["Canterra","Horizontal","Amalfi",null,2,2,0,1,96,65.709999999999994,null,"No",2,null,"Si","Si","Si","Preparación para minisplit.",{"$f":"_xlfn.XLOOKUP(Tabla62[[#This Row],[Nombre_desarrollo]],[1]Inf_general_desarrollo!$A:$A,[1]Inf_general_desarrollo!$C:$C)","v":"Cerámico"},{"$f":"_xlfn.XLOOKUP($A288,[1]Inf_general_desarrollo!$A:$A,[1]Inf_general_desarrollo!$D:$D)","v":"60x60"},{"$f":"_xlfn.XLOOKUP($A288,[1]Inf_general_desarrollo!$A:$A,[1]Inf_general_desarrollo!$E:$E)","v":"Enyesado pulido, cocina de madera, granito pisos cerámicos."},{"$f":"_xlfn.XLOOKUP($A288,[1]Inf_general_desarrollo!$A:$A,[1]Inf_general_desarrollo!$F:$F)","v":"Vistas en piedra galarza y tipo madera."},{"$f":"_xlfn.XLOOKUP($A288,[1]Inf_general_desarrollo!$A:$A,[1]Inf_general_desarrollo!$G:$G)","v":"Yeso pulido"},{"$f":"_xlfn.XLOOKUP($A288,[1]Inf_general_desarrollo!$A:$A,[1]Inf_general_desarrollo!$I:$I)","v":"Concreto"}]
["Canterra","Horizontal","Capri- Capella",null,3,3,0,2,96,101.49,null,"No",2,null,"Si","Si","Si","Preparación para minisplit.",{"$f":"_xlfn.XLOOKUP(Tabla62[[#This Row],[Nombre_desarrollo]],[1]Inf_general_desarrollo!$A:$A,[1]Inf_general_desarrollo!$C:$C)","v":"Cerámico"},{"$f":"_xlfn.XLOOKUP($A289,[1]Inf_general_desarrollo!$A:$A,[1]Inf_general_desarrollo!$D:$D)","v":"60x60"},{"$f":"_xlfn.XLOOKUP($A289,[1]Inf_general_desarrollo!$A:$A,[1]Inf_general_desarrollo!$E:$E)","v":"Enyesado pulido, cocina de madera, granito pisos cerámicos."},{"$f":"_xlfn.XLOOKUP($A289,[1]Inf_general_desarrollo!$A:$A,[1]Inf_general_desarrollo!$F:$F)","v":"Vistas en piedra galarza y tipo madera."},{"$f":"_xlfn.XLOOKUP($A289,[1]Inf_general_desarrollo!$A:$A,[1]Inf_general_desarrollo!$G:$G)","v":"Yeso pulido"},{"$f":"_xlfn.XLOOKUP($A289,[1]Inf_general_desarrollo!$A:$A,[1]Inf_general_desarrollo!$I:$I)","v":"Concreto"}]
["Canterra","Horizontal","Mirante- Sonet",null,3,2,1,2,96,134.49,null,"No",2,null,"Si","Si","Si","Preparación para minisplit.",{"$f":"_xlfn.XLOOKUP(Tabla62[[#This Row],[Nombre_desarrollo]],[1]Inf_general_desarrollo!$A:$A,[1]Inf_general_desarrollo!$C:$C)","v":"Cerámico"},{"$f":"_xlfn.XLOOKUP($A290,[1]Inf_general_desarrollo!$A:$A,[1]Inf_general_desarrollo!$D:$D)","v":"60x60"},{"$f":"_xlfn.XLOOKUP($A290,[1]Inf_general_desarrollo!$A:$A,[1]Inf_general_desarrollo!$E:$E)","v":"Enyesado pulido, cocina de madera, granito pisos cerámicos."},{"$f":"_xlfn.XLOOKUP($A290,[1]Inf_general_desarrollo!$A:$A,[1]Inf_general_desarrollo!$F:$F)","v":"Vistas en piedra galarza y tipo madera."},{"$f":"_xlfn.XLOOKUP($A290,[1]Inf_general_desarrollo!$A:$A,[1]Inf_general_desarrollo!$G:$G)","v":"Yeso pulido"},{"$f":"_xlfn.XLOOKUP($A290,[1]Inf_general_desarrollo!$A:$A,[1]Inf_general_desarrollo!$I:$I)","v":"Concreto"}]
["Canterra","Horizontal","Porto",null,3,2,1,2,96,149.53,null,"No",2,null,"Si","Si","Si","Preparación para minisplit.",{"$f":"_xlfn.XLOOKUP(Tabla62[[#This Row],[Nombre_desarrollo]],[1]Inf_general_desarrollo!$A:$A,[1]Inf_general_desarrollo!$C:$C)","v":"Cerámico"},{"$f":"_xlfn.XLOOKUP($A291,[1]Inf_general_desarrollo!$A:$A,[1]Inf_general_desarrollo!$D:$D)","v":"60x60"},{"$f":"_xlfn.XLOOKUP($A291,[1]Inf_general_desarrollo!$A:$A,[1]Inf_general_desarrollo!$E:$E)","v":"Enyesado pulido, cocina de madera, granito pisos cerámicos."},{"$f":"_xlfn.XLOOKUP($A291,[1]Inf_general_desarrollo!$A:$A,[1]Inf_general_desarrollo!$F:$F)","v":"Vistas en piedra galarza y tipo madera."},{"$f":"_xlfn.XLOOKUP($A291,[1]Inf_general_desarrollo!$A:$A,[1]Inf_general_desarrollo!$G:$G)","v":"Yeso pulido"},{"$f":"_xlfn.XLOOKUP($A291,[1]Inf_general_desarrollo!$A:$A,[1]Inf_general_desarrollo!$I:$I)","v":"Concreto"}]
["Canterra","Horizontal","Solara",null,4,3,1,3,96,162.75,null,"No",2,null,"Si","Si","Si","Preparación para minisplit.",{"$f":"_xlfn.XLOOKUP(Tabla62[[#This Row],[Nombre_desarrollo]],[1]Inf_general_desarrollo!$A:$A,[1]Inf_general_desarrollo!$C:$C)","v":"Cerámico"},{"$f":"_xlfn.XLOOKUP($A292,[1]Inf_general_desarrollo!$A:$A,[1]Inf_general_desarrollo!$D:$D)","v":"60x60"},{"$f":"_xlfn.XLOOKUP($A292,[1]Inf_general_desarrollo!$A:$A,[1]Inf_general_desarrollo!$E:$E)","v":"Enyesado pulido, cocina de madera, granito pisos cerámicos."},{"$f":"_xlfn.XLOOKUP($A292,[1]Inf_general_desarrollo!$A:$A,[1]Inf_general_desarrollo!$F:$F)","v":"Vistas en piedra galarza y tipo madera."},{"$f":"_xlfn.XLOOKUP($A292,[1]Inf_general_desarrollo!$A:$A,[1]Inf_general_desarrollo!$G:$G)","v":"Yeso pulido"},{"$f":"_xlfn.XLOOKUP($A292,[1]Inf_general_desarrollo!$A:$A,[1]Inf_general_desarrollo!$I:$I)","v":"Concreto"}]
["Stacia-Sub etapa 3","Horizontal","Gea",null,3,2,0,1,119,90,7,"No",2,null,"Si","Si","Si","Instalación para gas natural y minisplit.",{"$f":"_xlfn.XLOOKUP(Tabla62[[#This Row],[Nombre_desarrollo]],[1]Inf_general_desarrollo!$A:$A,[1]Inf_general_desarrollo!$C:$C)","v":"Cerámico"},{"$f":"_xlfn.XLOOKUP($A293,[1]Inf_general_desarrollo!$A:$A,[1]Inf_general_desarrollo!$D:$D)","v":"40x60"},{"$f":"_xlfn.XLOOKUP($A293,[1]Inf_general_desarrollo!$A:$A,[1]Inf_general_desarrollo!$E:$E)","v":"Espacios para closet, paredes en yeso pulido, cristal templado en escaleras, accesorios de baño."},{"$f":"_xlfn.XLOOKUP($A293,[1]Inf_general_desarrollo!$A:$A,[1]Inf_general_desarrollo!$F:$F)","v":"Cochera con huellas de concreto y jardín, aluminio negro y detalles en cantera."},{"$f":"_xlfn.XLOOKUP($A293,[1]Inf_general_desarrollo!$A:$A,[1]Inf_general_desarrollo!$G:$G)","v":"Yeso pulido"},{"$f":"_xlfn.XLOOKUP($A293,[1]Inf_general_desarrollo!$A:$A,[1]Inf_general_desarrollo!$I:$I)","v":"Concreto"}]
["Stacia-Sub etapa 3","Horizontal","Eros",null,3,3,0,2,119,102,7,"No",2,null,"Si","Si","Si","Instalación para gas natural y minisplit.",{"$f":"_xlfn.XLOOKUP(Tabla62[[#This Row],[Nombre_desarrollo]],[1]Inf_general_desarrollo!$A:$A,[1]Inf_general_desarrollo!$C:$C)","v":"Cerámico"},{"$f":"_xlfn.XLOOKUP($A294,[1]Inf_general_desarrollo!$A:$A,[1]Inf_general_desarrollo!$D:$D)","v":"40x60"},{"$f":"_xlfn.XLOOKUP($A294,[1]Inf_general_desarrollo!$A:$A,[1]Inf_general_desarrollo!$E:$E)","v":"Espacios para closet, paredes en yeso pulido, cristal templado en escaleras, accesorios de baño."},{"$f":"_xlfn.XLOOKUP($A294,[1]Inf_general_desarrollo!$A:$A,[1]Inf_general_desarrollo!$F:$F)","v":"Cochera con huellas de concreto y jardín, aluminio negro y detalles en cantera."},{"$f":"_xlfn.XLOOKUP($A294,[1]Inf_general_desarrollo!$A:$A,[1]Inf_general_desarrollo!$G:$G)","v":"Yeso pulido"},{"$f":"_xlfn.XLOOKUP($A294,[1]Inf_general_desarrollo!$A:$A,[1]Inf_general_desarrollo!$I:$I)","v":"Concreto"}]
["Stacia-Sub etapa 3","Horizontal","Talos",null,4,3,0,2,119,147,7,"No",2,null,"Si","Si","Si","Instalación para gas natural y minisplit.",{"$f":"_xlfn.XLOOKUP(Tabla62[[#This Row],[Nombre_desarrollo]],[1]Inf_general_desarrollo!$A:$A,[1]Inf_general_desarrollo!$C:$C)","v":"Cerámico"},{"$f":"_xlfn.XLOOKUP($A295,[1]Inf_general_desarrollo!$A:$A,[1]Inf_general_desarrollo!$D:$D)","v":"40x60"},{"$f":"_xlfn.XLOOKUP($A295,[1]Inf_general_desarrollo!$A:$A,[1]Inf_general_desarrollo!$E:$E)","v":"Espacios para closet, paredes en yeso pulido, cristal templado en escaleras, accesorios de baño."},{"$f":"_xlfn.XLOOKUP($A295,[1]Inf_general_desarrollo!$A:$A,[1]Inf_general_desarrollo!$F:$F)","v":"Cochera con huellas de concreto y jardín, aluminio negro y detalles en cantera."},{"$f":"_xlfn.XLOOKUP($A295,[1]Inf_general_desarrollo!$A:$A,[1]Inf_general_desarrollo!$G:$G)","v":"Yeso pulido"},{"$f":"_xlfn.XLOOKUP($A295,[1]Inf_general_desarrollo!$A:$A,[1]Inf_general_desarrollo!$I:$I)","v":"Concreto"}]
["Stacia-Sub etapa 3","Horizontal","Ares",null,3,2,1,2,119,122.55,7,"No",2,null,"Si","Si","Si","Instalación para gas natural y minisplit.",{"$f":"_xlfn.XLOOKUP(Tabla62[[#This Row],[Nombre_desarrollo]],[1]Inf_general_desarrollo!$A:$A,[1]Inf_general_desarrollo!$C:$C)","v":"Cerámico"},{"$f":"_xlfn.XLOOKUP($A296,[1]Inf_general_desarrollo!$A:$A,[1]Inf_general_desarrollo!$D:$D)","v":"40x60"},{"$f":"_xlfn.XLOOKUP($A296,[1]Inf_general_desarrollo!$A:$A,[1]Inf_general_desarrollo!$E:$E)","v":"Espacios para closet, paredes en yeso pulido, cristal templado en escaleras, accesorios de baño."},{"$f":"_xlfn.XLOOKUP($A296,[1]Inf_general_desarrollo!$A:$A,[1]Inf_general_desarrollo!$F:$F)","v":"Cochera con huellas de concreto y jardín, aluminio negro y detalles en cantera."},{"$f":"_xlfn.XLOOKUP($A296,[1]Inf_general_desarrollo!$A:$A,[1]Inf_general_desarrollo!$G:$G)","v":"Yeso pulido"},{"$f":"_xlfn.XLOOKUP($A296,[1]Inf_general_desarrollo!$A:$A,[1]Inf_general_desarrollo!$I:$I)","v":"Concreto"}]
["Stacia-Sub etapa 3","Horizontal","Enio",null,2,2,1,2,119,106,7,"No",2,null,"Si","Si","Si","Instalación para gas natural y minisplit.",{"$f":"_xlfn.XLOOKUP(Tabla62[[#This Row],[Nombre_desarrollo]],[1]Inf_general_desarrollo!$A:$A,[1]Inf_general_desarrollo!$C:$C)","v":"Cerámico"},{"$f":"_xlfn.XLOOKUP($A297,[1]Inf_general_desarrollo!$A:$A,[1]Inf_general_desarrollo!$D:$D)","v":"40x60"},{"$f":"_xlfn.XLOOKUP($A297,[1]Inf_general_desarrollo!$A:$A,[1]Inf_general_desarrollo!$E:$E)","v":"Espacios para closet, paredes en yeso pulido, cristal templado en escaleras, accesorios de baño."},{"$f":"_xlfn.XLOOKUP($A297,[1]Inf_general_desarrollo!$A:$A,[1]Inf_general_desarrollo!$F:$F)","v":"Cochera con huellas de concreto y jardín, aluminio negro y detalles en cantera."},{"$f":"_xlfn.XLOOKUP($A297,[1]Inf_general_desarrollo!$A:$A,[1]Inf_general_desarrollo!$G:$G)","v":"Yeso pulido"},{"$f":"_xlfn.XLOOKUP($A297,[1]Inf_general_desarrollo!$A:$A,[1]Inf_general_desarrollo!$I:$I)","v":"Concreto"}]
["Stacia-Sub etapa 3","Horizontal","Merida",null,3,2,1,2,119,108,7,"No",2,null,"Si","Si","Si","Instalación para gas natural y minisplit.",{"$f":"_xlfn.XLOOKUP(Tabla62[[#This Row],[Nombre_desarrollo]],[1]Inf_general_desarrollo!$A:$A,[1]Inf_general_desarrollo!$C:$C)","v":"Cerámico"},{"$f":"_xlfn.XLOOKUP($A298,[1]Inf_general_desarrollo!$A:$A,[1]Inf_general_desarrollo!$D:$D)","v":"40x60"},{"$f":"_xlfn.XLOOKUP($A298,[1]Inf_general_desarrollo!$A:$A,[1]Inf_general_desarrollo!$E:$E)","v":"Espacios para closet, paredes en yeso pulido, cristal templado en escaleras, accesorios de baño."},{"$f":"_xlfn.XLOOKUP($A298,[1]Inf_general_desarrollo!$A:$A,[1]Inf_general_desarrollo!$F:$F)","v":"Cochera con huellas de concreto y jardín, aluminio negro y detalles en cantera."},{"$f":"_xlfn.XLOOKUP($A298,[1]Inf_general_desarrollo!$A:$A,[1]Inf_general_desarrollo!$G:$G)","v":"Yeso pulido"},{"$f":"_xlfn.XLOOKUP($A298,[1]Inf_general_desarrollo!$A:$A,[1]Inf_general_desarrollo!$I:$I)","v":"Concreto"}]
["Villas de Montecassino- Etapa 3","Horizontal","Milan",null,2,1,1,2,90,67.45,6.5,"Si",2,null,"Si","Si","Si","Instalaciones para boiler, lavadora, calentador de paso y minisplit",{"$f":"_xlfn.XLOOKUP(Tabla62[[#This Row],[Nombre_desarrollo]],[1]Inf_general_desarrollo!$A:$A,[1]Inf_general_desarrollo!$C:$C)","v":"Cerámico"},{"$f":"_xlfn.XLOOKUP($A299,[1]Inf_general_desarrollo!$A:$A,[1]Inf_general_desarrollo!$D:$D)","v":"60x60"},{"$f":"_xlfn.XLOOKUP($A299,[1]Inf_general_desarrollo!$A:$A,[1]Inf_general_desarrollo!$E:$E)","v":"Yeso pulido en predes, cocina de madera MDF y granito, pisos cerámicos."},{"$f":"_xlfn.XLOOKUP($A299,[1]Inf_general_desarrollo!$A:$A,[1]Inf_general_desarrollo!$F:$F)","v":"Vista en piedra tipo cantera."},{"$f":"_xlfn.XLOOKUP($A299,[1]Inf_general_desarrollo!$A:$A,[1]Inf_general_desarrollo!$G:$G)","v":"Yeso pulido"},{"$f":"_xlfn.XLOOKUP($A299,[1]Inf_general_desarrollo!$A:$A,[1]Inf_general_desarrollo!$I:$I)","v":"Concreto Hidráulico"}]
["Villas de Montecassino- Etapa 3","Horizontal","Napoles",null,3,2,0,2,90,79.48,6.5,"Si",2,null,"Si","Si","Si","Instalaciones para boiler, lavadora, calentador de paso y minisplit",{"$f":"_xlfn.XLOOKUP(Tabla62[[#This Row],[Nombre_desarrollo]],[1]Inf_general_desarrollo!$A:$A,[1]Inf_general_desarrollo!$C:$C)","v":"Cerámico"},{"$f":"_xlfn.XLOOKUP($A300,[1]Inf_general_desarrollo!$A:$A,[1]Inf_general_desarrollo!$D:$D)","v":"60x60"},{"$f":"_xlfn.XLOOKUP($A300,[1]Inf_general_desarrollo!$A:$A,[1]Inf_general_desarrollo!$E:$E)","v":"Yeso pulido en predes, cocina de madera MDF y granito, pisos cerámicos."},{"$f":"_xlfn.XLOOKUP($A300,[1]Inf_general_desarrollo!$A:$A,[1]Inf_general_desarrollo!$F:$F)","v":"Vista en piedra tipo cantera."},{"$f":"_xlfn.XLOOKUP($A300,[1]Inf_general_desarrollo!$A:$A,[1]Inf_general_desarrollo!$G:$G)","v":"Yeso pulido"},{"$f":"_xlfn.XLOOKUP($A300,[1]Inf_general_desarrollo!$A:$A,[1]Inf_general_desarrollo!$I:$I)","v":"Concreto Hidráulico"}]
["Villas de Montecassino- Etapa 3","Horizontal","Siena",null,3,3,0,2,102,98.67,6.5,"Si",2,null,"Si","Si","Si","Instalaciones para boiler, lavadora, calentador de paso y minisplit",{"$f":"_xlfn.XLOOKUP(Tabla62[[#This Row],[Nombre_desarrollo]],[1]Inf_general_desarrollo!$A:$A,[1]Inf_general_desarrollo!$C:$C)","v":"Cerámico"},{"$f":"_xlfn.XLOOKUP($A301,[1]Inf_general_desarrollo!$A:$A,[1]Inf_general_desarrollo!$D:$D)","v":"60x60"},{"$f":"_xlfn.XLOOKUP($A301,[1]Inf_general_desarrollo!$A:$A,[1]Inf_general_desarrollo!$E:$E)","v":"Yeso pulido en predes, cocina de madera MDF y granito, pisos cerámicos."},{"$f":"_xlfn.XLOOKUP($A301,[1]Inf_general_desarrollo!$A:$A,[1]Inf_general_desarrollo!$F:$F)","v":"Vista en piedra tipo cantera."},{"$f":"_xlfn.XLOOKUP($A301,[1]Inf_general_desarrollo!$A:$A,[1]Inf_general_desarrollo!$G:$G)","v":"Yeso pulido"},{"$f":"_xlfn.XLOOKUP($A301,[1]Inf_general_desarrollo!$A:$A,[1]Inf_general_desarrollo!$I:$I)","v":"Concreto Hidráulico"}]
["Villas de Montecassino- Etapa 3","Horizontal","Turin",null,3,3,1,2,102,95.72,6.5,"Si",2,null,"Si","Si","Si","Instalaciones para boiler, lavadora, calentador de paso y minisplit",{"$f":"_xlfn.XLOOKUP(Tabla62[[#This Row],[Nombre_desarrollo]],[1]Inf_general_desarrollo!$A:$A,[1]Inf_general_desarrollo!$C:$C)","v":"Cerámico"},{"$f":"_xlfn.XLOOKUP($A302,[1]Inf_general_desarrollo!$A:$A,[1]Inf_general_desarrollo!$D:$D)","v":"60x60"},{"$f":"_xlfn.XLOOKUP($A302,[1]Inf_general_desarrollo!$A:$A,[1]Inf_general_desarrollo!$E:$E)","v":"Yeso pulido en predes, cocina de madera MDF y granito, pisos cerámicos."},{"$f":"_xlfn.XLOOKUP($A302,[1]Inf_general_desarrollo!$A:$A,[1]Inf_general_desarrollo!$F:$F)","v":"Vista en piedra tipo cantera."},{"$f":"_xlfn.XLOOKUP($A302,[1]Inf_general_desarrollo!$A:$A,[1]Inf_general_desarrollo!$G:$G)","v":"Yeso pulido"},{"$f":"_xlfn.XLOOKUP($A302,[1]Inf_general_desarrollo!$A:$A,[1]Inf_general_desarrollo!$I:$I)","v":"Concreto Hidráulico"}]
["Real del Bosque","Horizontal","Oyamel",null,3,3,0,2,112.5,126.43,null,null,2,null,"si","si","si","-",{"$f":"_xlfn.XLOOKUP(Tabla62[[#This Row],[Nombre_desarrollo]],[1]Inf_general_desarrollo!$A:$A,[1]Inf_general_desarrollo!$C:$C)","v":"Cerámico"},{"$f":"_xlfn.XLOOKUP($A303,[1]Inf_general_desarrollo!$A:$A,[1]Inf_general_desarrollo!$D:$D)","v":"40x60"},{"$f":"_xlfn.XLOOKUP($A303,[1]Inf_general_desarrollo!$A:$A,[1]Inf_general_desarrollo!$E:$E)","v":"paredes en yeso pulido, cristal templado en escaleras, accesorios de baño."},{"$f":"_xlfn.XLOOKUP($A303,[1]Inf_general_desarrollo!$A:$A,[1]Inf_general_desarrollo!$F:$F)","v":"Cochera con huellas de concreto y jardín, aluminio negro y detalles en cantera."},{"$f":"_xlfn.XLOOKUP($A303,[1]Inf_general_desarrollo!$A:$A,[1]Inf_general_desarrollo!$G:$G)","v":"Yeso pulido"},{"$f":"_xlfn.XLOOKUP($A303,[1]Inf_general_desarrollo!$A:$A,[1]Inf_general_desarrollo!$I:$I)","v":"Concreto Hidráulico"}]
["Real del Bosque","Horizontal","Bambu",null,3,3,0,2,105,132.1,null,null,2,null,"si","si","si","-",{"$f":"_xlfn.XLOOKUP(Tabla62[[#This Row],[Nombre_desarrollo]],[1]Inf_general_desarrollo!$A:$A,[1]Inf_general_desarrollo!$C:$C)","v":"Cerámico"},{"$f":"_xlfn.XLOOKUP($A304,[1]Inf_general_desarrollo!$A:$A,[1]Inf_general_desarrollo!$D:$D)","v":"40x60"},{"$f":"_xlfn.XLOOKUP($A304,[1]Inf_general_desarrollo!$A:$A,[1]Inf_general_desarrollo!$E:$E)","v":"paredes en yeso pulido, cristal templado en escaleras, accesorios de baño."},{"$f":"_xlfn.XLOOKUP($A304,[1]Inf_general_desarrollo!$A:$A,[1]Inf_general_desarrollo!$F:$F)","v":"Cochera con huellas de concreto y jardín, aluminio negro y detalles en cantera."},{"$f":"_xlfn.XLOOKUP($A304,[1]Inf_general_desarrollo!$A:$A,[1]Inf_general_desarrollo!$G:$G)","v":"Yeso pulido"},{"$f":"_xlfn.XLOOKUP($A304,[1]Inf_general_desarrollo!$A:$A,[1]Inf_general_desarrollo!$I:$I)","v":"Concreto Hidráulico"}]
["Real del Bosque","Horizontal","Valdiviana",null,3,2,1,2,105,137.84,null,null,2,null,"si","si","si","-",{"$f":"_xlfn.XLOOKUP(Tabla62[[#This Row],[Nombre_desarrollo]],[1]Inf_general_desarrollo!$A:$A,[1]Inf_general_desarrollo!$C:$C)","v":"Cerámico"},{"$f":"_xlfn.XLOOKUP($A305,[1]Inf_general_desarrollo!$A:$A,[1]Inf_general_desarrollo!$D:$D)","v":"40x60"},{"$f":"_xlfn.XLOOKUP($A305,[1]Inf_general_desarrollo!$A:$A,[1]Inf_general_desarrollo!$E:$E)","v":"paredes en yeso pulido, cristal templado en escaleras, accesorios de baño."},{"$f":"_xlfn.XLOOKUP($A305,[1]Inf_general_desarrollo!$A:$A,[1]Inf_general_desarrollo!$F:$F)","v":"Cochera con huellas de concreto y jardín, aluminio negro y detalles en cantera."},{"$f":"_xlfn.XLOOKUP($A305,[1]Inf_general_desarrollo!$A:$A,[1]Inf_general_desarrollo!$G:$G)","v":"Yeso pulido"},{"$f":"_xlfn.XLOOKUP($A305,[1]Inf_general_desarrollo!$A:$A,[1]Inf_general_desarrollo!$I:$I)","v":"Concreto Hidráulico"}]
["Real del Bosque","Horizontal","Broceliande",null,3,2,1,2,105,141.69,null,null,2,null,"si","si","si","-",{"$f":"_xlfn.XLOOKUP(Tabla62[[#This Row],[Nombre_desarrollo]],[1]Inf_general_desarrollo!$A:$A,[1]Inf_general_desarrollo!$C:$C)","v":"Cerámico"},{"$f":"_xlfn.XLOOKUP($A306,[1]Inf_general_desarrollo!$A:$A,[1]Inf_general_desarrollo!$D:$D)","v":"40x60"},{"$f":"_xlfn.XLOOKUP($A306,[1]Inf_general_desarrollo!$A:$A,[1]Inf_general_desarrollo!$E:$E)","v":"paredes en yeso pulido, cristal templado en escaleras, accesorios de baño."},{"$f":"_xlfn.XLOOKUP($A306,[1]Inf_general_desarrollo!$A:$A,[1]Inf_general_desarrollo!$F:$F)","v":"Cochera con huellas de concreto y jardín, aluminio negro y detalles en cantera."},{"$f":"_xlfn.XLOOKUP($A306,[1]Inf_general_desarrollo!$A:$A,[1]Inf_general_desarrollo!$G:$G)","v":"Yeso pulido"},{"$f":"_xlfn.XLOOKUP($A306,[1]Inf_general_desarrollo!$A:$A,[1]Inf_general_desarrollo!$I:$I)","v":"Concreto Hidráulico"}]
["Caranday II- Creta","Horizontal","Toscana",null,3,2,1,2,126,120.32,6,"Si",2,null,"Si","Si","Si","Minsplit, boiler",{"$f":"_xlfn.XLOOKUP(Tabla62[[#This Row],[Nombre_desarrollo]],[1]Inf_general_desarrollo!$A:$A,[1]Inf_general_desarrollo!$C:$C)","v":"Cerámico"},{"$f":"_xlfn.XLOOKUP($A307,[1]Inf_general_desarrollo!$A:$A,[1]Inf_general_desarrollo!$D:$D)","v":"60x60"},{"$f":"_xlfn.XLOOKUP($A307,[1]Inf_general_desarrollo!$A:$A,[1]Inf_general_desarrollo!$E:$E)","v":"yeso pulido, cocina de madera y granito, pisos cerámicos."},{"$f":"_xlfn.XLOOKUP($A307,[1]Inf_general_desarrollo!$A:$A,[1]Inf_general_desarrollo!$F:$F)","v":"yeso pulido, vistas de fachaleta"},{"$f":"_xlfn.XLOOKUP($A307,[1]Inf_general_desarrollo!$A:$A,[1]Inf_general_desarrollo!$G:$G)","v":0},{"$f":"_xlfn.XLOOKUP($A307,[1]Inf_general_desarrollo!$A:$A,[1]Inf_general_desarrollo!$I:$I)","v":"Concreto"}]
["Caranday II- Creta","Horizontal","Zafiro",null,4,3,0,2,126,125.89,6,"Si",2,null,"Si","Si","Si","Minsplit, boiler",{"$f":"_xlfn.XLOOKUP(Tabla62[[#This Row],[Nombre_desarrollo]],[1]Inf_general_desarrollo!$A:$A,[1]Inf_general_desarrollo!$C:$C)","v":"Cerámico"},{"$f":"_xlfn.XLOOKUP($A308,[1]Inf_general_desarrollo!$A:$A,[1]Inf_general_desarrollo!$D:$D)","v":"60x60"},{"$f":"_xlfn.XLOOKUP($A308,[1]Inf_general_desarrollo!$A:$A,[1]Inf_general_desarrollo!$E:$E)","v":"yeso pulido, cocina de madera y granito, pisos cerámicos."},{"$f":"_xlfn.XLOOKUP($A308,[1]Inf_general_desarrollo!$A:$A,[1]Inf_general_desarrollo!$F:$F)","v":"yeso pulido, vistas de fachaleta"},{"$f":"_xlfn.XLOOKUP($A308,[1]Inf_general_desarrollo!$A:$A,[1]Inf_general_desarrollo!$G:$G)","v":0},{"$f":"_xlfn.XLOOKUP($A308,[1]Inf_general_desarrollo!$A:$A,[1]Inf_general_desarrollo!$I:$I)","v":"Concreto"}]
["Amandra","Horizontal","Aria",null,2,2,0,1,102,110.25,null,"no",2,null,"Si","Si","Si","Preparación para minisplit.",{"$f":"_xlfn.XLOOKUP(Tabla62[[#This Row],[Nombre_desarrollo]],[1]Inf_general_desarrollo!$A:$A,[1]Inf_general_desarrollo!$C:$C)","v":"Cerámico"},{"$f":"_xlfn.XLOOKUP($A309,[1]Inf_general_desarrollo!$A:$A,[1]Inf_general_desarrollo!$D:$D)","v":"60x60"},{"$f":"_xlfn.XLOOKUP($A309,[1]Inf_general_desarrollo!$A:$A,[1]Inf_general_desarrollo!$E:$E)","v":"Enyesado pulido, cocina de madera, granito pisos cerámicos."},{"$f":"_xlfn.XLOOKUP($A309,[1]Inf_general_desarrollo!$A:$A,[1]Inf_general_desarrollo!$F:$F)","v":"Vistas en loseta tipo madera y cantera gris."},{"$f":"_xlfn.XLOOKUP($A309,[1]Inf_general_desarrollo!$A:$A,[1]Inf_general_desarrollo!$G:$G)","v":"Yeso pulido"},{"$f":"_xlfn.XLOOKUP($A309,[1]Inf_general_desarrollo!$A:$A,[1]Inf_general_desarrollo!$I:$I)","v":"Concreto"}]
["Amandra","Horizontal","Kenia",null,3,3,0,2,102,161.6,null,"no",2,null,"Si","Si","Si","Preparación para minisplit.",{"$f":"_xlfn.XLOOKUP(Tabla62[[#This Row],[Nombre_desarrollo]],[1]Inf_general_desarrollo!$A:$A,[1]Inf_general_desarrollo!$C:$C)","v":"Cerámico"},{"$f":"_xlfn.XLOOKUP($A310,[1]Inf_general_desarrollo!$A:$A,[1]Inf_general_desarrollo!$D:$D)","v":"60x60"},{"$f":"_xlfn.XLOOKUP($A310,[1]Inf_general_desarrollo!$A:$A,[1]Inf_general_desarrollo!$E:$E)","v":"Enyesado pulido, cocina de madera, granito pisos cerámicos."},{"$f":"_xlfn.XLOOKUP($A310,[1]Inf_general_desarrollo!$A:$A,[1]Inf_general_desarrollo!$F:$F)","v":"Vistas en loseta tipo madera y cantera gris."},{"$f":"_xlfn.XLOOKUP($A310,[1]Inf_general_desarrollo!$A:$A,[1]Inf_general_desarrollo!$G:$G)","v":"Yeso pulido"},{"$f":"_xlfn.XLOOKUP($A310,[1]Inf_general_desarrollo!$A:$A,[1]Inf_general_desarrollo!$I:$I)","v":"Concreto"}]
["Amandra","Horizontal","Atena",null,2,2,1,2,102,135.21,null,"no",2,null,"Si","Si","Si","Preparación para minisplit.",{"$f":"_xlfn.XLOOKUP(Tabla62[[#This Row],[Nombre_desarrollo]],[1]Inf_general_desarrollo!$A:$A,[1]Inf_general_desarrollo!$C:$C)","v":"Cerámico"},{"$f":"_xlfn.XLOOKUP($A311,[1]Inf_general_desarrollo!$A:$A,[1]Inf_general_desarrollo!$D:$D)","v":"60x60"},{"$f":"_xlfn.XLOOKUP($A311,[1]Inf_general_desarrollo!$A:$A,[1]Inf_general_desarrollo!$E:$E)","v":"Enyesado pulido, cocina de madera, granito pisos cerámicos."},{"$f":"_xlfn.XLOOKUP($A311,[1]Inf_general_desarrollo!$A:$A,[1]Inf_general_desarrollo!$F:$F)","v":"Vistas en loseta tipo madera y cantera gris."},{"$f":"_xlfn.XLOOKUP($A311,[1]Inf_general_desarrollo!$A:$A,[1]Inf_general_desarrollo!$G:$G)","v":"Yeso pulido"},{"$f":"_xlfn.XLOOKUP($A311,[1]Inf_general_desarrollo!$A:$A,[1]Inf_general_desarrollo!$I:$I)","v":"Concreto"}]
["Amandra","Horizontal","Venti",null,3,2,1,2,102,168.16,null,"no",2,null,"Si","Si","Si","Preparación para minisplit.",{"$f":"_xlfn.XLOOKUP(Tabla62[[#This Row],[Nombre_desarrollo]],[1]Inf_general_desarrollo!$A:$A,[1]Inf_general_desarrollo!$C:$C)","v":"Cerámico"},{"$f":"_xlfn.XLOOKUP($A312,[1]Inf_general_desarrollo!$A:$A,[1]Inf_general_desarrollo!$D:$D)","v":"60x60"},{"$f":"_xlfn.XLOOKUP($A312,[1]Inf_general_desarrollo!$A:$A,[1]Inf_general_desarrollo!$E:$E)","v":"Enyesado pulido, cocina de madera, granito pisos cerámicos."},{"$f":"_xlfn.XLOOKUP($A312,[1]Inf_general_desarrollo!$A:$A,[1]Inf_general_desarrollo!$F:$F)","v":"Vistas en loseta tipo madera y cantera gris."},{"$f":"_xlfn.XLOOKUP($A312,[1]Inf_general_desarrollo!$A:$A,[1]Inf_general_desarrollo!$G:$G)","v":"Yeso pulido"},{"$f":"_xlfn.XLOOKUP($A312,[1]Inf_general_desarrollo!$A:$A,[1]Inf_general_desarrollo!$I:$I)","v":"Concreto"}]
["Carena Cluster 5","Horizontal","Amina",null,2,1,1,2,96,"77.4",6,"-",2,null,"-","Si","Si","-",{"$f":"_xlfn.XLOOKUP(Tabla62[[#This Row],[Nombre_desarrollo]],[1]Inf_general_desarrollo!$A:$A,[1]Inf_general_desarrollo!$C:$C)","v":"Rectificado"},{"$f":"_xlfn.XLOOKUP($A313,[1]Inf_general_desarrollo!$A:$A,[1]Inf_general_desarrollo!$D:$D)","v":"60x60"},{"$f":"_xlfn.XLOOKUP($A313,[1]Inf_general_desarrollo!$A:$A,[1]Inf_general_desarrollo!$E:$E)","v":"Barandal de herreria en escalera, yeso pulido, lavamanos sencillo, regaderas revestidas."},{"$f":"_xlfn.XLOOKUP($A313,[1]Inf_general_desarrollo!$A:$A,[1]Inf_general_desarrollo!$F:$F)","v":"Huellas de cemento en cochera, marcos de aluminio en color negro."},{"$f":"_xlfn.XLOOKUP($A313,[1]Inf_general_desarrollo!$A:$A,[1]Inf_general_desarrollo!$G:$G)","v":"Yeso pulido"},{"$f":"_xlfn.XLOOKUP($A313,[1]Inf_general_desarrollo!$A:$A,[1]Inf_general_desarrollo!$I:$I)","v":"Concreto Hidráulico"}]
["Carena Cluster 5","Horizontal","Mara",null,2,2,1,2,96,"95.3",6,"-",2,null,"-","Si","Si","-",{"$f":"_xlfn.XLOOKUP(Tabla62[[#This Row],[Nombre_desarrollo]],[1]Inf_general_desarrollo!$A:$A,[1]Inf_general_desarrollo!$C:$C)","v":"Rectificado"},{"$f":"_xlfn.XLOOKUP($A314,[1]Inf_general_desarrollo!$A:$A,[1]Inf_general_desarrollo!$D:$D)","v":"60x60"},{"$f":"_xlfn.XLOOKUP($A314,[1]Inf_general_desarrollo!$A:$A,[1]Inf_general_desarrollo!$E:$E)","v":"Barandal de herreria en escalera, yeso pulido, lavamanos sencillo, regaderas revestidas."},{"$f":"_xlfn.XLOOKUP($A314,[1]Inf_general_desarrollo!$A:$A,[1]Inf_general_desarrollo!$F:$F)","v":"Huellas de cemento en cochera, marcos de aluminio en color negro."},{"$f":"_xlfn.XLOOKUP($A314,[1]Inf_general_desarrollo!$A:$A,[1]Inf_general_desarrollo!$G:$G)","v":"Yeso pulido"},{"$f":"_xlfn.XLOOKUP($A314,[1]Inf_general_desarrollo!$A:$A,[1]Inf_general_desarrollo!$I:$I)","v":"Concreto Hidráulico"}]
["Carena Cluster 5","Horizontal","Alana",null,3,3,0,2,96,"100.2",6,"-",2,null,"-","Si","Si","-",{"$f":"_xlfn.XLOOKUP(Tabla62[[#This Row],[Nombre_desarrollo]],[1]Inf_general_desarrollo!$A:$A,[1]Inf_general_desarrollo!$C:$C)","v":"Rectificado"},{"$f":"_xlfn.XLOOKUP($A315,[1]Inf_general_desarrollo!$A:$A,[1]Inf_general_desarrollo!$D:$D)","v":"60x60"},{"$f":"_xlfn.XLOOKUP($A315,[1]Inf_general_desarrollo!$A:$A,[1]Inf_general_desarrollo!$E:$E)","v":"Barandal de herreria en escalera, yeso pulido, lavamanos sencillo, regaderas revestidas."},{"$f":"_xlfn.XLOOKUP($A315,[1]Inf_general_desarrollo!$A:$A,[1]Inf_general_desarrollo!$F:$F)","v":"Huellas de cemento en cochera, marcos de aluminio en color negro."},{"$f":"_xlfn.XLOOKUP($A315,[1]Inf_general_desarrollo!$A:$A,[1]Inf_general_desarrollo!$G:$G)","v":"Yeso pulido"},{"$f":"_xlfn.XLOOKUP($A315,[1]Inf_general_desarrollo!$A:$A,[1]Inf_general_desarrollo!$I:$I)","v":"Concreto Hidráulico"}]
["Carena Cluster 5","Horizontal","Zaira",null,4,3,0,2,96,112,6,"-",2,null,"-","Si","Si","-",{"$f":"_xlfn.XLOOKUP(Tabla62[[#This Row],[Nombre_desarrollo]],[1]Inf_general_desarrollo!$A:$A,[1]Inf_general_desarrollo!$C:$C)","v":"Rectificado"},{"$f":"_xlfn.XLOOKUP($A316,[1]Inf_general_desarrollo!$A:$A,[1]Inf_general_desarrollo!$D:$D)","v":"60x60"},{"$f":"_xlfn.XLOOKUP($A316,[1]Inf_general_desarrollo!$A:$A,[1]Inf_general_desarrollo!$E:$E)","v":"Barandal de herreria en escalera, yeso pulido, lavamanos sencillo, regaderas revestidas."},{"$f":"_xlfn.XLOOKUP($A316,[1]Inf_general_desarrollo!$A:$A,[1]Inf_general_desarrollo!$F:$F)","v":"Huellas de cemento en cochera, marcos de aluminio en color negro."},{"$f":"_xlfn.XLOOKUP($A316,[1]Inf_general_desarrollo!$A:$A,[1]Inf_general_desarrollo!$G:$G)","v":"Yeso pulido"},{"$f":"_xlfn.XLOOKUP($A316,[1]Inf_general_desarrollo!$A:$A,[1]Inf_general_desarrollo!$I:$I)","v":"Concreto Hidráulico"}]
["Carena Cluster 5","Horizontal","Everest",null,3,1,1,2,96,76,6,"-",2,null,"-","Si","Si","-",{"$f":"_xlfn.XLOOKUP(Tabla62[[#This Row],[Nombre_desarrollo]],[1]Inf_general_desarrollo!$A:$A,[1]Inf_general_desarrollo!$C:$C)","v":"Rectificado"},{"$f":"_xlfn.XLOOKUP($A317,[1]Inf_general_desarrollo!$A:$A,[1]Inf_general_desarrollo!$D:$D)","v":"60x60"},{"$f":"_xlfn.XLOOKUP($A317,[1]Inf_general_desarrollo!$A:$A,[1]Inf_general_desarrollo!$E:$E)","v":"Barandal de herreria en escalera, yeso pulido, lavamanos sencillo, regaderas revestidas."},{"$f":"_xlfn.XLOOKUP($A317,[1]Inf_general_desarrollo!$A:$A,[1]Inf_general_desarrollo!$F:$F)","v":"Huellas de cemento en cochera, marcos de aluminio en color negro."},{"$f":"_xlfn.XLOOKUP($A317,[1]Inf_general_desarrollo!$A:$A,[1]Inf_general_desarrollo!$G:$G)","v":"Yeso pulido"},{"$f":"_xlfn.XLOOKUP($A317,[1]Inf_general_desarrollo!$A:$A,[1]Inf_general_desarrollo!$I:$I)","v":"Concreto Hidráulico"}]
["Carena Cluster 5","Horizontal","Denali",null,3,2,1,2,96,90,6,"-",2,null,"-","Si","Si","-",{"$f":"_xlfn.XLOOKUP(Tabla62[[#This Row],[Nombre_desarrollo]],[1]Inf_general_desarrollo!$A:$A,[1]Inf_general_desarrollo!$C:$C)","v":"Rectificado"},{"$f":"_xlfn.XLOOKUP($A318,[1]Inf_general_desarrollo!$A:$A,[1]Inf_general_desarrollo!$D:$D)","v":"60x60"},{"$f":"_xlfn.XLOOKUP($A318,[1]Inf_general_desarrollo!$A:$A,[1]Inf_general_desarrollo!$E:$E)","v":"Barandal de herreria en escalera, yeso pulido, lavamanos sencillo, regaderas revestidas."},{"$f":"_xlfn.XLOOKUP($A318,[1]Inf_general_desarrollo!$A:$A,[1]Inf_general_desarrollo!$F:$F)","v":"Huellas de cemento en cochera, marcos de aluminio en color negro."},{"$f":"_xlfn.XLOOKUP($A318,[1]Inf_general_desarrollo!$A:$A,[1]Inf_general_desarrollo!$G:$G)","v":"Yeso pulido"},{"$f":"_xlfn.XLOOKUP($A318,[1]Inf_general_desarrollo!$A:$A,[1]Inf_general_desarrollo!$I:$I)","v":"Concreto Hidráulico"}]
["Hacienda el Cobano -Cedro Blanco","Horizontal","Sierra Fría",null,3,2,1,2,114,135,6,"No",2,null,"Si","Si","Si","Boiler, lavadora, minisplit, secadora.",{"$f":"_xlfn.XLOOKUP(Tabla62[[#This Row],[Nombre_desarrollo]],[1]Inf_general_desarrollo!$A:$A,[1]Inf_general_desarrollo!$C:$C)","v":"Cerámico"},{"$f":"_xlfn.XLOOKUP($A319,[1]Inf_general_desarrollo!$A:$A,[1]Inf_general_desarrollo!$D:$D)","v":"60x60"},{"$f":"_xlfn.XLOOKUP($A319,[1]Inf_general_desarrollo!$A:$A,[1]Inf_general_desarrollo!$E:$E)","v":"Yeso pulido, acabados en granito en cocina, mármol en lavabos, barandal de cristal en escaleras."},{"$f":"_xlfn.XLOOKUP($A319,[1]Inf_general_desarrollo!$A:$A,[1]Inf_general_desarrollo!$F:$F)","v":"Yeso pulido, vistas de fachaleta tipo madera de piedra."},{"$f":"_xlfn.XLOOKUP($A319,[1]Inf_general_desarrollo!$A:$A,[1]Inf_general_desarrollo!$G:$G)","v":"Yeso pulido"},{"$f":"_xlfn.XLOOKUP($A319,[1]Inf_general_desarrollo!$A:$A,[1]Inf_general_desarrollo!$I:$I)","v":"Concreto"}]
["Hacienda el Cobano -Cedro Blanco","Horizontal","Aveiro",null,3,2,1,2,114,162,7,"No",2,null,"Si","Si","Si","Boiler, lavadora, minisplit, secadora.",{"$f":"_xlfn.XLOOKUP(Tabla62[[#This Row],[Nombre_desarrollo]],[1]Inf_general_desarrollo!$A:$A,[1]Inf_general_desarrollo!$C:$C)","v":"Cerámico"},{"$f":"_xlfn.XLOOKUP($A320,[1]Inf_general_desarrollo!$A:$A,[1]Inf_general_desarrollo!$D:$D)","v":"60x60"},{"$f":"_xlfn.XLOOKUP($A320,[1]Inf_general_desarrollo!$A:$A,[1]Inf_general_desarrollo!$E:$E)","v":"Yeso pulido, acabados en granito en cocina, mármol en lavabos, barandal de cristal en escaleras."},{"$f":"_xlfn.XLOOKUP($A320,[1]Inf_general_desarrollo!$A:$A,[1]Inf_general_desarrollo!$F:$F)","v":"Yeso pulido, vistas de fachaleta tipo madera de piedra."},{"$f":"_xlfn.XLOOKUP($A320,[1]Inf_general_desarrollo!$A:$A,[1]Inf_general_desarrollo!$G:$G)","v":"Yeso pulido"},{"$f":"_xlfn.XLOOKUP($A320,[1]Inf_general_desarrollo!$A:$A,[1]Inf_general_desarrollo!$I:$I)","v":"Concreto"}]
["Hacienda el Cobano -Cedro Blanco","Horizontal","Altamira",null,3,3,0,2,114,182,7,"Si",2,null,"Si","Si","Si","Boiler, lavadora, minisplit, secadora.",{"$f":"_xlfn.XLOOKUP(Tabla62[[#This Row],[Nombre_desarrollo]],[1]Inf_general_desarrollo!$A:$A,[1]Inf_general_desarrollo!$C:$C)","v":"Cerámico"},{"$f":"_xlfn.XLOOKUP($A321,[1]Inf_general_desarrollo!$A:$A,[1]Inf_general_desarrollo!$D:$D)","v":"60x60"},{"$f":"_xlfn.XLOOKUP($A321,[1]Inf_general_desarrollo!$A:$A,[1]Inf_general_desarrollo!$E:$E)","v":"Yeso pulido, acabados en granito en cocina, mármol en lavabos, barandal de cristal en escaleras."},{"$f":"_xlfn.XLOOKUP($A321,[1]Inf_general_desarrollo!$A:$A,[1]Inf_general_desarrollo!$F:$F)","v":"Yeso pulido, vistas de fachaleta tipo madera de piedra."},{"$f":"_xlfn.XLOOKUP($A321,[1]Inf_general_desarrollo!$A:$A,[1]Inf_general_desarrollo!$G:$G)","v":"Yeso pulido"},{"$f":"_xlfn.XLOOKUP($A321,[1]Inf_general_desarrollo!$A:$A,[1]Inf_general_desarrollo!$I:$I)","v":"Concreto"}]
["Canterra - Etapa 2","Horizontal","Amalfi",null,2,2,0,1,96,65.7,"-","No",2,null,"Si","Si","Si","Preparación para minisplit.",{"$f":"_xlfn.XLOOKUP(Tabla62[[#This Row],[Nombre_desarrollo]],[1]Inf_general_desarrollo!$A:$A,[1]Inf_general_desarrollo!$C:$C)","v":"Cerámico"},{"$f":"_xlfn.XLOOKUP($A322,[1]Inf_general_desarrollo!$A:$A,[1]Inf_general_desarrollo!$D:$D)","v":"60x60"},{"$f":"_xlfn.XLOOKUP($A322,[1]Inf_general_desarrollo!$A:$A,[1]Inf_general_desarrollo!$E:$E)","v":"Enyesado pulido, cocina de madera, granito pisos cerámicos."},{"$f":"_xlfn.XLOOKUP($A322,[1]Inf_general_desarrollo!$A:$A,[1]Inf_general_desarrollo!$F:$F)","v":"Vistas en piedra galarza y tipo madera."},{"$f":"_xlfn.XLOOKUP($A322,[1]Inf_general_desarrollo!$A:$A,[1]Inf_general_desarrollo!$G:$G)","v":"Yeso pulido"},{"$f":"_xlfn.XLOOKUP($A322,[1]Inf_general_desarrollo!$A:$A,[1]Inf_general_desarrollo!$I:$I)","v":"Concreto"}]
["Canterra - Etapa 2","Horizontal","Capri- Capella",null,3,3,0,2,96,101.5,"-","No",2,null,"Si","Si","Si","Preparación para minisplit.",{"$f":"_xlfn.XLOOKUP(Tabla62[[#This Row],[Nombre_desarrollo]],[1]Inf_general_desarrollo!$A:$A,[1]Inf_general_desarrollo!$C:$C)","v":"Cerámico"},{"$f":"_xlfn.XLOOKUP($A323,[1]Inf_general_desarrollo!$A:$A,[1]Inf_general_desarrollo!$D:$D)","v":"60x60"},{"$f":"_xlfn.XLOOKUP($A323,[1]Inf_general_desarrollo!$A:$A,[1]Inf_general_desarrollo!$E:$E)","v":"Enyesado pulido, cocina de madera, granito pisos cerámicos."},{"$f":"_xlfn.XLOOKUP($A323,[1]Inf_general_desarrollo!$A:$A,[1]Inf_general_desarrollo!$F:$F)","v":"Vistas en piedra galarza y tipo madera."},{"$f":"_xlfn.XLOOKUP($A323,[1]Inf_general_desarrollo!$A:$A,[1]Inf_general_desarrollo!$G:$G)","v":"Yeso pulido"},{"$f":"_xlfn.XLOOKUP($A323,[1]Inf_general_desarrollo!$A:$A,[1]Inf_general_desarrollo!$I:$I)","v":"Concreto"}]
["Canterra - Etapa 2","Horizontal","Mirante- Sonet",null,3,2,1,2,96,134.5,"-","No",2,null,"Si","Si","Si","Preparación para minisplit.",{"$f":"_xlfn.XLOOKUP(Tabla62[[#This Row],[Nombre_desarrollo]],[1]Inf_general_desarrollo!$A:$A,[1]Inf_general_desarrollo!$C:$C)","v":"Cerámico"},{"$f":"_xlfn.XLOOKUP($A324,[1]Inf_general_desarrollo!$A:$A,[1]Inf_general_desarrollo!$D:$D)","v":"60x60"},{"$f":"_xlfn.XLOOKUP($A324,[1]Inf_general_desarrollo!$A:$A,[1]Inf_general_desarrollo!$E:$E)","v":"Enyesado pulido, cocina de madera, granito pisos cerámicos."},{"$f":"_xlfn.XLOOKUP($A324,[1]Inf_general_desarrollo!$A:$A,[1]Inf_general_desarrollo!$F:$F)","v":"Vistas en piedra galarza y tipo madera."},{"$f":"_xlfn.XLOOKUP($A324,[1]Inf_general_desarrollo!$A:$A,[1]Inf_general_desarrollo!$G:$G)","v":"Yeso pulido"},{"$f":"_xlfn.XLOOKUP($A324,[1]Inf_general_desarrollo!$A:$A,[1]Inf_general_desarrollo!$I:$I)","v":"Concreto"}]
["Canterra - Etapa 2","Horizontal","Porto",null,3,2,1,2,96,149.5,"-","No",2,null,"Si","Si","Si","Preparación para minisplit.",{"$f":"_xlfn.XLOOKUP(Tabla62[[#This Row],[Nombre_desarrollo]],[1]Inf_general_desarrollo!$A:$A,[1]Inf_general_desarrollo!$C:$C)","v":"Cerámico"},{"$f":"_xlfn.XLOOKUP($A325,[1]Inf_general_desarrollo!$A:$A,[1]Inf_general_desarrollo!$D:$D)","v":"60x60"},{"$f":"_xlfn.XLOOKUP($A325,[1]Inf_general_desarrollo!$A:$A,[1]Inf_general_desarrollo!$E:$E)","v":"Enyesado pulido, cocina de madera, granito pisos cerámicos."},{"$f":"_xlfn.XLOOKUP($A325,[1]Inf_general_desarrollo!$A:$A,[1]Inf_general_desarrollo!$F:$F)","v":"Vistas en piedra galarza y tipo madera."},{"$f":"_xlfn.XLOOKUP($A325,[1]Inf_general_desarrollo!$A:$A,[1]Inf_general_desarrollo!$G:$G)","v":"Yeso pulido"},{"$f":"_xlfn.XLOOKUP($A325,[1]Inf_general_desarrollo!$A:$A,[1]Inf_general_desarrollo!$I:$I)","v":"Concreto"}]
["Canterra - Etapa 2","Horizontal","Solara",null,4,3,1,3,96,162.80000000000001,"-","No",2,null,"Si","Si","Si","Preparación para minisplit.",{"$f":"_xlfn.XLOOKUP(Tabla62[[#This Row],[Nombre_desarrollo]],[1]Inf_general_desarrollo!$A:$A,[1]Inf_general_desarrollo!$C:$C)","v":"Cerámico"},{"$f":"_xlfn.XLOOKUP($A326,[1]Inf_general_desarrollo!$A:$A,[1]Inf_general_desarrollo!$D:$D)","v":"60x60"},{"$f":"_xlfn.XLOOKUP($A326,[1]Inf_general_desarrollo!$A:$A,[1]Inf_general_desarrollo!$E:$E)","v":"Enyesado pulido, cocina de madera, granito pisos cerámicos."},{"$f":"_xlfn.XLOOKUP($A326,[1]Inf_general_desarrollo!$A:$A,[1]Inf_general_desarrollo!$F:$F)","v":"Vistas en piedra galarza y tipo madera."},{"$f":"_xlfn.XLOOKUP($A326,[1]Inf_general_desarrollo!$A:$A,[1]Inf_general_desarrollo!$G:$G)","v":"Yeso pulido"},{"$f":"_xlfn.XLOOKUP($A326,[1]Inf_general_desarrollo!$A:$A,[1]Inf_general_desarrollo!$I:$I)","v":"Concreto"}]
["Ronda Res - Reserva san Matias Etapa 2","Horizontal","Marbella",null,3,3,1,2,115.5,151.91999999999999,7,"No",2,null,"Si","Si","Si","Calentador de paso",{"$f":"_xlfn.XLOOKUP(Tabla62[[#This Row],[Nombre_desarrollo]],[1]Inf_general_desarrollo!$A:$A,[1]Inf_general_desarrollo!$C:$C)","v":"Cerámico"},{"$f":"_xlfn.XLOOKUP($A327,[1]Inf_general_desarrollo!$A:$A,[1]Inf_general_desarrollo!$D:$D)","v":"60x60"},{"$f":"_xlfn.XLOOKUP($A327,[1]Inf_general_desarrollo!$A:$A,[1]Inf_general_desarrollo!$E:$E)","v":"Accesorios de baño, paredes en yeso."},{"$f":"_xlfn.XLOOKUP($A327,[1]Inf_general_desarrollo!$A:$A,[1]Inf_general_desarrollo!$F:$F)","v":"Huellas de cemento en cochera"},{"$f":"_xlfn.XLOOKUP($A327,[1]Inf_general_desarrollo!$A:$A,[1]Inf_general_desarrollo!$G:$G)","v":"Yeso pulido"},{"$f":"_xlfn.XLOOKUP($A327,[1]Inf_general_desarrollo!$A:$A,[1]Inf_general_desarrollo!$I:$I)","v":"Concreto"}]
["Ronda Res - Reserva san Matias Etapa 2","Horizontal","Gelsa",null,3,3,0,2,115.5,130.33000000000001,7,"No",2,null,"Si","Si","Si","Calentador de paso",{"$f":"_xlfn.XLOOKUP(Tabla62[[#This Row],[Nombre_desarrollo]],[1]Inf_general_desarrollo!$A:$A,[1]Inf_general_desarrollo!$C:$C)","v":"Cerámico"},{"$f":"_xlfn.XLOOKUP($A328,[1]Inf_general_desarrollo!$A:$A,[1]Inf_general_desarrollo!$D:$D)","v":"60x60"},{"$f":"_xlfn.XLOOKUP($A328,[1]Inf_general_desarrollo!$A:$A,[1]Inf_general_desarrollo!$E:$E)","v":"Accesorios de baño, paredes en yeso."},{"$f":"_xlfn.XLOOKUP($A328,[1]Inf_general_desarrollo!$A:$A,[1]Inf_general_desarrollo!$F:$F)","v":"Huellas de cemento en cochera"},{"$f":"_xlfn.XLOOKUP($A328,[1]Inf_general_desarrollo!$A:$A,[1]Inf_general_desarrollo!$G:$G)","v":"Yeso pulido"},{"$f":"_xlfn.XLOOKUP($A328,[1]Inf_general_desarrollo!$A:$A,[1]Inf_general_desarrollo!$I:$I)","v":"Concreto"}]
["Ronda Res - Reserva san Matias Etapa 2","Horizontal","Borja",null,3,2,1,2,115.5,118.26,7,"No",2,null,"Si","Si","Si","Calentador de paso",{"$f":"_xlfn.XLOOKUP(Tabla62[[#This Row],[Nombre_desarrollo]],[1]Inf_general_desarrollo!$A:$A,[1]Inf_general_desarrollo!$C:$C)","v":"Cerámico"},{"$f":"_xlfn.XLOOKUP($A329,[1]Inf_general_desarrollo!$A:$A,[1]Inf_general_desarrollo!$D:$D)","v":"60x60"},{"$f":"_xlfn.XLOOKUP($A329,[1]Inf_general_desarrollo!$A:$A,[1]Inf_general_desarrollo!$E:$E)","v":"Accesorios de baño, paredes en yeso."},{"$f":"_xlfn.XLOOKUP($A329,[1]Inf_general_desarrollo!$A:$A,[1]Inf_general_desarrollo!$F:$F)","v":"Huellas de cemento en cochera"},{"$f":"_xlfn.XLOOKUP($A329,[1]Inf_general_desarrollo!$A:$A,[1]Inf_general_desarrollo!$G:$G)","v":"Yeso pulido"},{"$f":"_xlfn.XLOOKUP($A329,[1]Inf_general_desarrollo!$A:$A,[1]Inf_general_desarrollo!$I:$I)","v":"Concreto"}]
["Ronda Res - Reserva san Matias Etapa 2","Horizontal","Neiva",null,2,2,0,2,115.5,90.1,7,"No",2,null,"Si","Si","Si","Calentador de paso",{"$f":"_xlfn.XLOOKUP(Tabla62[[#This Row],[Nombre_desarrollo]],[1]Inf_general_desarrollo!$A:$A,[1]Inf_general_desarrollo!$C:$C)","v":"Cerámico"},{"$f":"_xlfn.XLOOKUP($A330,[1]Inf_general_desarrollo!$A:$A,[1]Inf_general_desarrollo!$D:$D)","v":"60x60"},{"$f":"_xlfn.XLOOKUP($A330,[1]Inf_general_desarrollo!$A:$A,[1]Inf_general_desarrollo!$E:$E)","v":"Accesorios de baño, paredes en yeso."},{"$f":"_xlfn.XLOOKUP($A330,[1]Inf_general_desarrollo!$A:$A,[1]Inf_general_desarrollo!$F:$F)","v":"Huellas de cemento en cochera"},{"$f":"_xlfn.XLOOKUP($A330,[1]Inf_general_desarrollo!$A:$A,[1]Inf_general_desarrollo!$G:$G)","v":"Yeso pulido"},{"$f":"_xlfn.XLOOKUP($A330,[1]Inf_general_desarrollo!$A:$A,[1]Inf_general_desarrollo!$I:$I)","v":"Concreto"}]
["Ronda Res - Reserva san Matias Etapa 2","Horizontal","Guinea",null,3,2,1,2,115.5,144.80000000000001,7,"No",2,null,"Si","Si","Si","Calentador de paso",{"$f":"_xlfn.XLOOKUP(Tabla62[[#This Row],[Nombre_desarrollo]],[1]Inf_general_desarrollo!$A:$A,[1]Inf_general_desarrollo!$C:$C)","v":"Cerámico"},{"$f":"_xlfn.XLOOKUP($A331,[1]Inf_general_desarrollo!$A:$A,[1]Inf_general_desarrollo!$D:$D)","v":"60x60"},{"$f":"_xlfn.XLOOKUP($A331,[1]Inf_general_desarrollo!$A:$A,[1]Inf_general_desarrollo!$E:$E)","v":"Accesorios de baño, paredes en yeso."},{"$f":"_xlfn.XLOOKUP($A331,[1]Inf_general_desarrollo!$A:$A,[1]Inf_general_desarrollo!$F:$F)","v":"Huellas de cemento en cochera"},{"$f":"_xlfn.XLOOKUP($A331,[1]Inf_general_desarrollo!$A:$A,[1]Inf_general_desarrollo!$G:$G)","v":"Yeso pulido"},{"$f":"_xlfn.XLOOKUP($A331,[1]Inf_general_desarrollo!$A:$A,[1]Inf_general_desarrollo!$I:$I)","v":"Concreto"}]
["San Gerardo Residencial - Coto Lucano","Horizontal","Noria",null,2,1,1,2,77.5,62.1,5,"No",1,null,"Si","Si","Si","Instalación para gas natural y minisplit.",{"$f":"_xlfn.XLOOKUP(Tabla62[[#This Row],[Nombre_desarrollo]],[1]Inf_general_desarrollo!$A:$A,[1]Inf_general_desarrollo!$C:$C)","v":"Cerámico"},{"$f":"_xlfn.XLOOKUP($A332,[1]Inf_general_desarrollo!$A:$A,[1]Inf_general_desarrollo!$D:$D)","v":"60x60"},{"$f":"_xlfn.XLOOKUP($A332,[1]Inf_general_desarrollo!$A:$A,[1]Inf_general_desarrollo!$E:$E)","v":"Paredes en yeso pulido, muebles de baño y accesorios,"},{"$f":"_xlfn.XLOOKUP($A332,[1]Inf_general_desarrollo!$A:$A,[1]Inf_general_desarrollo!$F:$F)","v":"Cochera con huellas de cemento, detalles tipo piedra, ventanas con marco de aluminio."},{"$f":"_xlfn.XLOOKUP($A332,[1]Inf_general_desarrollo!$A:$A,[1]Inf_general_desarrollo!$G:$G)","v":"Yeso pulido"},{"$f":"_xlfn.XLOOKUP($A332,[1]Inf_general_desarrollo!$A:$A,[1]Inf_general_desarrollo!$I:$I)","v":"Concreto"}]
["San Gerardo Residencial - Coto Lucano","Horizontal","Perla",null,3,2,0,1,99,65,6,"No",1,null,"Si","Si","Si","Instalación para gas natural y minisplit.",{"$f":"_xlfn.XLOOKUP(Tabla62[[#This Row],[Nombre_desarrollo]],[1]Inf_general_desarrollo!$A:$A,[1]Inf_general_desarrollo!$C:$C)","v":"Cerámico"},{"$f":"_xlfn.XLOOKUP($A333,[1]Inf_general_desarrollo!$A:$A,[1]Inf_general_desarrollo!$D:$D)","v":"60x60"},{"$f":"_xlfn.XLOOKUP($A333,[1]Inf_general_desarrollo!$A:$A,[1]Inf_general_desarrollo!$E:$E)","v":"Paredes en yeso pulido, muebles de baño y accesorios,"},{"$f":"_xlfn.XLOOKUP($A333,[1]Inf_general_desarrollo!$A:$A,[1]Inf_general_desarrollo!$F:$F)","v":"Cochera con huellas de cemento, detalles tipo piedra, ventanas con marco de aluminio."},{"$f":"_xlfn.XLOOKUP($A333,[1]Inf_general_desarrollo!$A:$A,[1]Inf_general_desarrollo!$G:$G)","v":"Yeso pulido"},{"$f":"_xlfn.XLOOKUP($A333,[1]Inf_general_desarrollo!$A:$A,[1]Inf_general_desarrollo!$I:$I)","v":"Concreto"}]
["San Gerardo Residencial - Coto Lucano","Horizontal","Berlin",null,3,2,1,2,99,99.5,6,"No",2,null,"Si","Si","Si","Instalación para gas natural y minisplit.",{"$f":"_xlfn.XLOOKUP(Tabla62[[#This Row],[Nombre_desarrollo]],[1]Inf_general_desarrollo!$A:$A,[1]Inf_general_desarrollo!$C:$C)","v":"Cerámico"},{"$f":"_xlfn.XLOOKUP($A334,[1]Inf_general_desarrollo!$A:$A,[1]Inf_general_desarrollo!$D:$D)","v":"60x60"},{"$f":"_xlfn.XLOOKUP($A334,[1]Inf_general_desarrollo!$A:$A,[1]Inf_general_desarrollo!$E:$E)","v":"Paredes en yeso pulido, muebles de baño y accesorios,"},{"$f":"_xlfn.XLOOKUP($A334,[1]Inf_general_desarrollo!$A:$A,[1]Inf_general_desarrollo!$F:$F)","v":"Cochera con huellas de cemento, detalles tipo piedra, ventanas con marco de aluminio."},{"$f":"_xlfn.XLOOKUP($A334,[1]Inf_general_desarrollo!$A:$A,[1]Inf_general_desarrollo!$G:$G)","v":"Yeso pulido"},{"$f":"_xlfn.XLOOKUP($A334,[1]Inf_general_desarrollo!$A:$A,[1]Inf_general_desarrollo!$I:$I)","v":"Concreto"}]
["Castelo San Francisco- Etapa 3","Horizontal","Bardi Plus",null,3,2,1,1,111,66,6,"No",2,null,"Si","Si","Si","Lavadora, secadora, gas, calentdor solar, minisplit, antenas de tv.",{"$f":"_xlfn.XLOOKUP(Tabla62[[#This Row],[Nombre_desarrollo]],[1]Inf_general_desarrollo!$A:$A,[1]Inf_general_desarrollo!$C:$C)","v":"Cerámico"},{"$f":"_xlfn.XLOOKUP($A335,[1]Inf_general_desarrollo!$A:$A,[1]Inf_general_desarrollo!$D:$D)","v":"60x60"},{"$f":"_xlfn.XLOOKUP($A335,[1]Inf_general_desarrollo!$A:$A,[1]Inf_general_desarrollo!$E:$E)","v":"Yeso pulido, acabados en granito en barras de cocina, baños revestidos."},{"$f":"_xlfn.XLOOKUP($A335,[1]Inf_general_desarrollo!$A:$A,[1]Inf_general_desarrollo!$F:$F)","v":"Yeso pulido, fachaleta tipo madera y acedor en modelo moncalieri."},{"$f":"_xlfn.XLOOKUP($A335,[1]Inf_general_desarrollo!$A:$A,[1]Inf_general_desarrollo!$G:$G)","v":"Yeso pulido"},{"$f":"_xlfn.XLOOKUP($A335,[1]Inf_general_desarrollo!$A:$A,[1]Inf_general_desarrollo!$I:$I)","v":"Concreto Hidráulico"}]
["Castelo San Francisco- Etapa 3","Horizontal","Miramare",null,3,2,1,2,111,115,6,"No",2,null,"Si","Si","Si","Lavadora, secadora, gas, calentdor solar, minisplit, antenas de tv.",{"$f":"_xlfn.XLOOKUP(Tabla62[[#This Row],[Nombre_desarrollo]],[1]Inf_general_desarrollo!$A:$A,[1]Inf_general_desarrollo!$C:$C)","v":"Cerámico"},{"$f":"_xlfn.XLOOKUP($A336,[1]Inf_general_desarrollo!$A:$A,[1]Inf_general_desarrollo!$D:$D)","v":"60x60"},{"$f":"_xlfn.XLOOKUP($A336,[1]Inf_general_desarrollo!$A:$A,[1]Inf_general_desarrollo!$E:$E)","v":"Yeso pulido, acabados en granito en barras de cocina, baños revestidos."},{"$f":"_xlfn.XLOOKUP($A336,[1]Inf_general_desarrollo!$A:$A,[1]Inf_general_desarrollo!$F:$F)","v":"Yeso pulido, fachaleta tipo madera y acedor en modelo moncalieri."},{"$f":"_xlfn.XLOOKUP($A336,[1]Inf_general_desarrollo!$A:$A,[1]Inf_general_desarrollo!$G:$G)","v":"Yeso pulido"},{"$f":"_xlfn.XLOOKUP($A336,[1]Inf_general_desarrollo!$A:$A,[1]Inf_general_desarrollo!$I:$I)","v":"Concreto Hidráulico"}]
["Castelo San Francisco- Etapa 3","Horizontal","Balasi",null,4,3,1,2,111,130,6,"No",2,null,"Si","Si","Si","Lavadora, secadora, gas, calentdor solar, minisplit, antenas de tv.",{"$f":"_xlfn.XLOOKUP(Tabla62[[#This Row],[Nombre_desarrollo]],[1]Inf_general_desarrollo!$A:$A,[1]Inf_general_desarrollo!$C:$C)","v":"Cerámico"},{"$f":"_xlfn.XLOOKUP($A337,[1]Inf_general_desarrollo!$A:$A,[1]Inf_general_desarrollo!$D:$D)","v":"60x60"},{"$f":"_xlfn.XLOOKUP($A337,[1]Inf_general_desarrollo!$A:$A,[1]Inf_general_desarrollo!$E:$E)","v":"Yeso pulido, acabados en granito en barras de cocina, baños revestidos."},{"$f":"_xlfn.XLOOKUP($A337,[1]Inf_general_desarrollo!$A:$A,[1]Inf_general_desarrollo!$F:$F)","v":"Yeso pulido, fachaleta tipo madera y acedor en modelo moncalieri."},{"$f":"_xlfn.XLOOKUP($A337,[1]Inf_general_desarrollo!$A:$A,[1]Inf_general_desarrollo!$G:$G)","v":"Yeso pulido"},{"$f":"_xlfn.XLOOKUP($A337,[1]Inf_general_desarrollo!$A:$A,[1]Inf_general_desarrollo!$I:$I)","v":"Concreto Hidráulico"}]
["Castelo San Francisco- Etapa 3","Horizontal","Tarento",null,2,2,1,2,111,109,6,"No",2,null,"Si","Si","Si","Lavadora, secadora, gas, calentdor solar, minisplit, antenas de tv.",{"$f":"_xlfn.XLOOKUP(Tabla62[[#This Row],[Nombre_desarrollo]],[1]Inf_general_desarrollo!$A:$A,[1]Inf_general_desarrollo!$C:$C)","v":"Cerámico"},{"$f":"_xlfn.XLOOKUP($A338,[1]Inf_general_desarrollo!$A:$A,[1]Inf_general_desarrollo!$D:$D)","v":"60x60"},{"$f":"_xlfn.XLOOKUP($A338,[1]Inf_general_desarrollo!$A:$A,[1]Inf_general_desarrollo!$E:$E)","v":"Yeso pulido, acabados en granito en barras de cocina, baños revestidos."},{"$f":"_xlfn.XLOOKUP($A338,[1]Inf_general_desarrollo!$A:$A,[1]Inf_general_desarrollo!$F:$F)","v":"Yeso pulido, fachaleta tipo madera y acedor en modelo moncalieri."},{"$f":"_xlfn.XLOOKUP($A338,[1]Inf_general_desarrollo!$A:$A,[1]Inf_general_desarrollo!$G:$G)","v":"Yeso pulido"},{"$f":"_xlfn.XLOOKUP($A338,[1]Inf_general_desarrollo!$A:$A,[1]Inf_general_desarrollo!$I:$I)","v":"Concreto Hidráulico"}]
["Castelo San Francisco- Etapa 3","Horizontal","melfi",null,2,1,1,2,111,98,6,"No",2,null,"Si","Si","Si","Lavadora, secadora, gas, calentdor solar, minisplit, antenas de tv.",{"$f":"_xlfn.XLOOKUP(Tabla62[[#This Row],[Nombre_desarrollo]],[1]Inf_general_desarrollo!$A:$A,[1]Inf_general_desarrollo!$C:$C)","v":"Cerámico"},{"$f":"_xlfn.XLOOKUP($A339,[1]Inf_general_desarrollo!$A:$A,[1]Inf_general_desarrollo!$D:$D)","v":"60x60"},{"$f":"_xlfn.XLOOKUP($A339,[1]Inf_general_desarrollo!$A:$A,[1]Inf_general_desarrollo!$E:$E)","v":"Yeso pulido, acabados en granito en barras de cocina, baños revestidos."},{"$f":"_xlfn.XLOOKUP($A339,[1]Inf_general_desarrollo!$A:$A,[1]Inf_general_desarrollo!$F:$F)","v":"Yeso pulido, fachaleta tipo madera y acedor en modelo moncalieri."},{"$f":"_xlfn.XLOOKUP($A339,[1]Inf_general_desarrollo!$A:$A,[1]Inf_general_desarrollo!$G:$G)","v":"Yeso pulido"},{"$f":"_xlfn.XLOOKUP($A339,[1]Inf_general_desarrollo!$A:$A,[1]Inf_general_desarrollo!$I:$I)","v":"Concreto Hidráulico"}]
["Paseos de los Viñedos ","Horizontal","Napa",null,2,1,0,1,90,47.63,"-","No",1,null,"Si","Si","Si","-",{"$f":"_xlfn.XLOOKUP(Tabla62[[#This Row],[Nombre_desarrollo]],[1]Inf_general_desarrollo!$A:$A,[1]Inf_general_desarrollo!$C:$C)","v":"Vitropiso"},{"$f":"_xlfn.XLOOKUP($A340,[1]Inf_general_desarrollo!$A:$A,[1]Inf_general_desarrollo!$D:$D)","v":"45x45"},{"$f":"_xlfn.XLOOKUP($A340,[1]Inf_general_desarrollo!$A:$A,[1]Inf_general_desarrollo!$E:$E)","v":"Muros de acabado en pasta, acabados en blanco. "},{"$f":"_xlfn.XLOOKUP($A340,[1]Inf_general_desarrollo!$A:$A,[1]Inf_general_desarrollo!$F:$F)","v":"-"},{"$f":"_xlfn.XLOOKUP($A340,[1]Inf_general_desarrollo!$A:$A,[1]Inf_general_desarrollo!$G:$G)","v":"-"},{"$f":"_xlfn.XLOOKUP($A340,[1]Inf_general_desarrollo!$A:$A,[1]Inf_general_desarrollo!$I:$I)","v":"-"}]
["Paseos de los Viñedos ","Horizontal","Claret",null,2,1,0,1,90,54.8,"-","No",1,null,"Si","Si","Si","-",{"$f":"_xlfn.XLOOKUP(Tabla62[[#This Row],[Nombre_desarrollo]],[1]Inf_general_desarrollo!$A:$A,[1]Inf_general_desarrollo!$C:$C)","v":"Vitropiso"},{"$f":"_xlfn.XLOOKUP($A341,[1]Inf_general_desarrollo!$A:$A,[1]Inf_general_desarrollo!$D:$D)","v":"45x45"},{"$f":"_xlfn.XLOOKUP($A341,[1]Inf_general_desarrollo!$A:$A,[1]Inf_general_desarrollo!$E:$E)","v":"Muros de acabado en pasta, acabados en blanco. "},{"$f":"_xlfn.XLOOKUP($A341,[1]Inf_general_desarrollo!$A:$A,[1]Inf_general_desarrollo!$F:$F)","v":"-"},{"$f":"_xlfn.XLOOKUP($A341,[1]Inf_general_desarrollo!$A:$A,[1]Inf_general_desarrollo!$G:$G)","v":"-"},{"$f":"_xlfn.XLOOKUP($A341,[1]Inf_general_desarrollo!$A:$A,[1]Inf_general_desarrollo!$I:$I)","v":"-"}]
["Paseos de los Viñedos ","Horizontal","Bonart",null,3,1,0,1,90,68.17,"-","No",1,null,"Si","Si","Si","-",{"$f":"_xlfn.XLOOKUP(Tabla62[[#This Row],[Nombre_desarrollo]],[1]Inf_general_desarrollo!$A:$A,[1]Inf_general_desarrollo!$C:$C)","v":"Vitropiso"},{"$f":"_xlfn.XLOOKUP($A342,[1]Inf_general_desarrollo!$A:$A,[1]Inf_general_desarrollo!$D:$D)","v":"45x45"},{"$f":"_xlfn.XLOOKUP($A342,[1]Inf_general_desarrollo!$A:$A,[1]Inf_general_desarrollo!$E:$E)","v":"Muros de acabado en pasta, acabados en blanco. "},{"$f":"_xlfn.XLOOKUP($A342,[1]Inf_general_desarrollo!$A:$A,[1]Inf_general_desarrollo!$F:$F)","v":"-"},{"$f":"_xlfn.XLOOKUP($A342,[1]Inf_general_desarrollo!$A:$A,[1]Inf_general_desarrollo!$G:$G)","v":"-"},{"$f":"_xlfn.XLOOKUP($A342,[1]Inf_general_desarrollo!$A:$A,[1]Inf_general_desarrollo!$I:$I)","v":"-"}]
["Villas de Don Antonio","Horizontal","Mitra",null,2,1,1,2,75,68,"-","No",1,null,"Si","Si","Si","Boiler, lavadora, minisplit, secadora.",{"$f":"_xlfn.XLOOKUP(Tabla62[[#This Row],[Nombre_desarrollo]],[1]Inf_general_desarrollo!$A:$A,[1]Inf_general_desarrollo!$C:$C)","v":"ceramico"},{"$f":"_xlfn.XLOOKUP($A343,[1]Inf_general_desarrollo!$A:$A,[1]Inf_general_desarrollo!$D:$D)","v":"55x55"},{"$f":"_xlfn.XLOOKUP($A343,[1]Inf_general_desarrollo!$A:$A,[1]Inf_general_desarrollo!$E:$E)","v":"Se entrega tarja en cocina, taza de baño y lavamanos pegado a pared. "},{"$f":"_xlfn.XLOOKUP($A343,[1]Inf_general_desarrollo!$A:$A,[1]Inf_general_desarrollo!$F:$F)","v":"Ventanas con marca de aluminio plateado. "},{"$f":"_xlfn.XLOOKUP($A343,[1]Inf_general_desarrollo!$A:$A,[1]Inf_general_desarrollo!$G:$G)","v":"Enyesado pulido"},{"$f":"_xlfn.XLOOKUP($A343,[1]Inf_general_desarrollo!$A:$A,[1]Inf_general_desarrollo!$I:$I)","v":"Concreto"}]
["Los Zarzales","Horizontal","Z_1",null,3,2,0,1,119,90,"-","No",2,null,"Si","Si","Si","Boiler, lavadora, minisplit, secadora.",{"$f":"_xlfn.XLOOKUP(Tabla62[[#This Row],[Nombre_desarrollo]],[1]Inf_general_desarrollo!$A:$A,[1]Inf_general_desarrollo!$C:$C)","v":"Cerámico"},{"$f":"_xlfn.XLOOKUP($A344,[1]Inf_general_desarrollo!$A:$A,[1]Inf_general_desarrollo!$D:$D)","v":"60x60"},{"$f":"_xlfn.XLOOKUP($A344,[1]Inf_general_desarrollo!$A:$A,[1]Inf_general_desarrollo!$E:$E)","v":"Yeso pulido, cocina con granito, lavabos ceramicos"},{"$f":"_xlfn.XLOOKUP($A344,[1]Inf_general_desarrollo!$A:$A,[1]Inf_general_desarrollo!$F:$F)","v":"Yeso pulido y vistas de piso ceramico tipo madera"},{"$f":"_xlfn.XLOOKUP($A344,[1]Inf_general_desarrollo!$A:$A,[1]Inf_general_desarrollo!$G:$G)","v":"Yeso pulido"},{"$f":"_xlfn.XLOOKUP($A344,[1]Inf_general_desarrollo!$A:$A,[1]Inf_general_desarrollo!$I:$I)","v":"Concreto"}]
["Los Zarzales","Horizontal","Z_2",null,3,1,1,2,119,121,"-","No",2,null,"Si","Si","Si","Boiler, lavadora, minisplit, secadora.",{"$f":"_xlfn.XLOOKUP(Tabla62[[#This Row],[Nombre_desarrollo]],[1]Inf_general_desarrollo!$A:$A,[1]Inf_general_desarrollo!$C:$C)","v":"Cerámico"},{"$f":"_xlfn.XLOOKUP($A345,[1]Inf_general_desarrollo!$A:$A,[1]Inf_general_desarrollo!$D:$D)","v":"60x60"},{"$f":"_xlfn.XLOOKUP($A345,[1]Inf_general_desarrollo!$A:$A,[1]Inf_general_desarrollo!$E:$E)","v":"Yeso pulido, cocina con granito, lavabos ceramicos"},{"$f":"_xlfn.XLOOKUP($A345,[1]Inf_general_desarrollo!$A:$A,[1]Inf_general_desarrollo!$F:$F)","v":"Yeso pulido y vistas de piso ceramico tipo madera"},{"$f":"_xlfn.XLOOKUP($A345,[1]Inf_general_desarrollo!$A:$A,[1]Inf_general_desarrollo!$G:$G)","v":"Yeso pulido"},{"$f":"_xlfn.XLOOKUP($A345,[1]Inf_general_desarrollo!$A:$A,[1]Inf_general_desarrollo!$I:$I)","v":"Concreto"}]
["Los Zarzales","Horizontal","Z_3",null,3,2,1,2,119,131,"-","No",2,null,"Si","Si","Si","Boiler, lavadora, minisplit, secadora.",{"$f":"_xlfn.XLOOKUP(Tabla62[[#This Row],[Nombre_desarrollo]],[1]Inf_general_desarrollo!$A:$A,[1]Inf_general_desarrollo!$C:$C)","v":"Cerámico"},{"$f":"_xlfn.XLOOKUP($A346,[1]Inf_general_desarrollo!$A:$A,[1]Inf_general_desarrollo!$D:$D)","v":"60x60"},{"$f":"_xlfn.XLOOKUP($A346,[1]Inf_general_desarrollo!$A:$A,[1]Inf_general_desarrollo!$E:$E)","v":"Yeso pulido, cocina con granito, lavabos ceramicos"},{"$f":"_xlfn.XLOOKUP($A346,[1]Inf_general_desarrollo!$A:$A,[1]Inf_general_desarrollo!$F:$F)","v":"Yeso pulido y vistas de piso ceramico tipo madera"},{"$f":"_xlfn.XLOOKUP($A346,[1]Inf_general_desarrollo!$A:$A,[1]Inf_general_desarrollo!$G:$G)","v":"Yeso pulido"},{"$f":"_xlfn.XLOOKUP($A346,[1]Inf_general_desarrollo!$A:$A,[1]Inf_general_desarrollo!$I:$I)","v":"Concreto"}]
["Los Zarzales","Horizontal","Z_4",null,3,3,0,2,119,135,"-","No",2,null,"Si","Si","Si","Boiler, lavadora, minisplit, secadora.",{"$f":"_xlfn.XLOOKUP(Tabla62[[#This Row],[Nombre_desarrollo]],[1]Inf_general_desarrollo!$A:$A,[1]Inf_general_desarrollo!$C:$C)","v":"Cerámico"},{"$f":"_xlfn.XLOOKUP($A347,[1]Inf_general_desarrollo!$A:$A,[1]Inf_general_desarrollo!$D:$D)","v":"60x60"},{"$f":"_xlfn.XLOOKUP($A347,[1]Inf_general_desarrollo!$A:$A,[1]Inf_general_desarrollo!$E:$E)","v":"Yeso pulido, cocina con granito, lavabos ceramicos"},{"$f":"_xlfn.XLOOKUP($A347,[1]Inf_general_desarrollo!$A:$A,[1]Inf_general_desarrollo!$F:$F)","v":"Yeso pulido y vistas de piso ceramico tipo madera"},{"$f":"_xlfn.XLOOKUP($A347,[1]Inf_general_desarrollo!$A:$A,[1]Inf_general_desarrollo!$G:$G)","v":"Yeso pulido"},{"$f":"_xlfn.XLOOKUP($A347,[1]Inf_general_desarrollo!$A:$A,[1]Inf_general_desarrollo!$I:$I)","v":"Concreto"}]
["Los Zarzales","Horizontal","Z_5",null,3,2,1,2,110,115,"-","No",2,null,"Si","Si","Si","Boiler, lavadora, minisplit, secadora.",{"$f":"_xlfn.XLOOKUP(Tabla62[[#This Row],[Nombre_desarrollo]],[1]Inf_general_desarrollo!$A:$A,[1]Inf_general_desarrollo!$C:$C)","v":"Cerámico"},{"$f":"_xlfn.XLOOKUP($A348,[1]Inf_general_desarrollo!$A:$A,[1]Inf_general_desarrollo!$D:$D)","v":"60x60"},{"$f":"_xlfn.XLOOKUP($A348,[1]Inf_general_desarrollo!$A:$A,[1]Inf_general_desarrollo!$E:$E)","v":"Yeso pulido, cocina con granito, lavabos ceramicos"},{"$f":"_xlfn.XLOOKUP($A348,[1]Inf_general_desarrollo!$A:$A,[1]Inf_general_desarrollo!$F:$F)","v":"Yeso pulido y vistas de piso ceramico tipo madera"},{"$f":"_xlfn.XLOOKUP($A348,[1]Inf_general_desarrollo!$A:$A,[1]Inf_general_desarrollo!$G:$G)","v":"Yeso pulido"},{"$f":"_xlfn.XLOOKUP($A348,[1]Inf_general_desarrollo!$A:$A,[1]Inf_general_desarrollo!$I:$I)","v":"Concreto"}]
["Los Zarzales","Horizontal","Z_6",null,3,2,1,2,110,115,"-","No",2,null,"Si","Si","Si","Boiler, lavadora, minisplit, secadora.",{"$f":"_xlfn.XLOOKUP(Tabla62[[#This Row],[Nombre_desarrollo]],[1]Inf_general_desarrollo!$A:$A,[1]Inf_general_desarrollo!$C:$C)","v":"Cerámico"},{"$f":"_xlfn.XLOOKUP($A349,[1]Inf_general_desarrollo!$A:$A,[1]Inf_general_desarrollo!$D:$D)","v":"60x60"},{"$f":"_xlfn.XLOOKUP($A349,[1]Inf_general_desarrollo!$A:$A,[1]Inf_general_desarrollo!$E:$E)","v":"Yeso pulido, cocina con granito, lavabos ceramicos"},{"$f":"_xlfn.XLOOKUP($A349,[1]Inf_general_desarrollo!$A:$A,[1]Inf_general_desarrollo!$F:$F)","v":"Yeso pulido y vistas de piso ceramico tipo madera"},{"$f":"_xlfn.XLOOKUP($A349,[1]Inf_general_desarrollo!$A:$A,[1]Inf_general_desarrollo!$G:$G)","v":"Yeso pulido"},{"$f":"_xlfn.XLOOKUP($A349,[1]Inf_general_desarrollo!$A:$A,[1]Inf_general_desarrollo!$I:$I)","v":"Concreto"}]
["Vistas del Valle","Horizontal","A_V",null,2,1,0,1,90,49,6,"No",1,null,"Si","Si","Si","Boiler, lavadora, minisplit, secadora.",{"$f":"_xlfn.XLOOKUP(Tabla62[[#This Row],[Nombre_desarrollo]],[1]Inf_general_desarrollo!$A:$A,[1]Inf_general_desarrollo!$C:$C)","v":"ceramico"},{"$f":"_xlfn.XLOOKUP($A350,[1]Inf_general_desarrollo!$A:$A,[1]Inf_general_desarrollo!$D:$D)","v":"55x55"},{"$f":"_xlfn.XLOOKUP($A350,[1]Inf_general_desarrollo!$A:$A,[1]Inf_general_desarrollo!$E:$E)","v":"Enyesado pulido"},{"$f":"_xlfn.XLOOKUP($A350,[1]Inf_general_desarrollo!$A:$A,[1]Inf_general_desarrollo!$F:$F)","v":" ventanas en aluminio color natural"},{"$f":"_xlfn.XLOOKUP($A350,[1]Inf_general_desarrollo!$A:$A,[1]Inf_general_desarrollo!$G:$G)","v":"Enyesado pulido"},{"$f":"_xlfn.XLOOKUP($A350,[1]Inf_general_desarrollo!$A:$A,[1]Inf_general_desarrollo!$I:$I)","v":"Concreto"}]
["Vistas del Valle","Horizontal","B_V",null,2,1,0,1,90,46,6,"No",2,null,"Si","Si","Si","Boiler, lavadora, minisplit, secadora.",{"$f":"_xlfn.XLOOKUP(Tabla62[[#This Row],[Nombre_desarrollo]],[1]Inf_general_desarrollo!$A:$A,[1]Inf_general_desarrollo!$C:$C)","v":"ceramico"},{"$f":"_xlfn.XLOOKUP($A351,[1]Inf_general_desarrollo!$A:$A,[1]Inf_general_desarrollo!$D:$D)","v":"55x55"},{"$f":"_xlfn.XLOOKUP($A351,[1]Inf_general_desarrollo!$A:$A,[1]Inf_general_desarrollo!$E:$E)","v":"Enyesado pulido"},{"$f":"_xlfn.XLOOKUP($A351,[1]Inf_general_desarrollo!$A:$A,[1]Inf_general_desarrollo!$F:$F)","v":" ventanas en aluminio color natural"},{"$f":"_xlfn.XLOOKUP($A351,[1]Inf_general_desarrollo!$A:$A,[1]Inf_general_desarrollo!$G:$G)","v":"Enyesado pulido"},{"$f":"_xlfn.XLOOKUP($A351,[1]Inf_general_desarrollo!$A:$A,[1]Inf_general_desarrollo!$I:$I)","v":"Concreto"}]
["Vistas del Valle"]
["Vistas del Valle"]

{"sheet":"Lote","index":4,"n_rows":2,"n_cols":38,"rows_kept":2,"cut":false,"hidden":false,"merged":[]}
["Nombre_desarrollo","Direccion","Zona","Desarrolladora","Comercializadora","Segementación ","Etapas_total_planeadas","Etapa_actual","Lotes_planeados","Número_prototipos","Descripción","Tipo_fraccionamiento","Acceso_desarrollo","Vigilancia","Regimen_condominio","Couota_mantenimineto","Amenidades","Otro","Credito_puente","Creditos_aceptados","%_enganche","Plazo_para_pago_de_enganche_(meses)","Plazo_para_pago_de_enganche_(días)","Importe_de_apartado","Importe_de_apartado_incluye_firma_de_contrato","Precio_incluye_escrituración","Medida_barda_perimetral_m2","Fecha_primer_levantamiento","Fecha_inicio_venta","Fecha_fin_ventas","Meses_venta","Fecha_estimada_entrega","Fecha_entrega_ofical","Fecha_inicio_construcción","Fecha_estimada_fin_contruccion","Fecha_fin_construcción","Estatus_obra","Estatus_venta"]
[null,null,null,null,null,null,null,null,null,null,null,null,null,null,null,null,null,null,null,null,null,null,null,null,null,null,null,null,null,{"$f":"IF(IFERROR(_xlfn.MINIFS(Tabla1012_1[Fecha],Tabla1012_1[Nombre_desarrollo],Tabla25[[#This Row],[Nombre_desarrollo]],Tabla1012_1[Inventario_disponible],0),\"\")>0,IFERROR(_xlfn.MINIFS(Tabla1012_1[Fecha],Tabla1012_1[Nombre_desarrollo],Tabla25[[#This Row],[Nombre_desarrollo]],Tabla1012_1[Inventario_disponible],0),\"\"),\"\")","v":""},{"$f":"IF(AND(Tabla25[[#This Row],[Fecha_inicio_venta]]=\"\",Tabla25[[#This Row],[Fecha_fin_ventas]]<>\"\"),\"Se necesita fecha_inicio_venta\",IF(AND(Tabla25[[#This Row],[Fecha_inicio_venta]]=\"\",Tabla25[[#This Row],[Fecha_fin_ventas]]=\"\"),\"\",IF(AND(Tabla25[[#This Row],[Fecha_inicio_venta]]<>\"\",Tabla25[[#This Row],[Fecha_fin_ventas]]=\"\"),(YEAR(TODAY())-YEAR(Tabla25[[#This Row],[Fecha_inicio_venta]]))*12 + MONTH(TODAY())-MONTH(Tabla25[[#This Row],[Fecha_inicio_venta]]),(YEAR(Tabla25[[#This Row],[Fecha_fin_ventas]])-YEAR(Tabla25[[#This Row],[Fecha_inicio_venta]]))*12 + MONTH(Tabla25[[#This Row],[Fecha_fin_ventas]])-MONTH(Tabla25[[#This Row],[Fecha_inicio_venta]]))))","v":""},null,null,null,null,null,{"$f":"_xlfn.IFS(AND(Tabla25[[#This Row],[Fecha_inicio_construcción]]<>\"\",Tabla25[[#This Row],[Fecha_fin_construcción]]=\"\"),\"En Construcción\",AND(Tabla25[[#This Row],[Fecha_inicio_construcción]]=\"\",Tabla25[[#This Row],[Fecha_fin_construcción]]=\"\"),\"Tierra\",AND(Tabla25[[#This Row],[Fecha_inicio_construcción]]<>\"\",Tabla25[[#This Row],[Fecha_fin_construcción]]<>\"\"),\"Terminado\",AND(Tabla25[[#This Row],[Fecha_fin_construcción]]<>\"\",Tabla25[[#This Row],[Fecha_inicio_construcción]]=\"\"),\"Falta Fecha:inicio:contruccon\")","v":"Tierra"},{"$f":"IF(IFERROR(INDEX(Tabla1012_1[Inventario_disponible],MATCH(1,(Tabla1012_1[Nombre_desarrollo]=Tabla25[[#This Row],[Nombre_desarrollo]])*(Tabla1012_1[Fecha]=_xlfn.MAXIFS(Tabla1012_1[Fecha],Tabla1012_1[Nombre_desarrollo],Tabla25[[#This Row],[Nombre_desarrollo]])),0)),\"\")=0,\"Vendido\",\"Disponible\")","v":"Disponible"}]

{"sheet":"Info_Prototipos_lote","index":5,"n_rows":1,"n_cols":6,"rows_kept":1,"cut":false,"hidden":false,"merged":[]}
["Nombre_desarrollo","Tipo_proyecto","Nombre_prototipos","Cantitdad_unidades_prototipo","Medida_terreno","Vialidades"]

{"sheet":"Amenidades","index":6,"n_rows":50,"n_cols":2,"rows_kept":50,"cut":false,"hidden":false,"merged":[]}
["Id_amenidades","Amenidad"]
[1,"Casa_club"]
[2,"Alberca"]
[3,"Parque_Juegos_infantiles"]
[4,"Gimnasio"]
[5,"Ciclopista"]
[6,"Fogateros"]
[7,"Spa"]
[8,"Cine"]
[9,"Dog_park"]
[10,"Roof_garden"]
[11,"Asadores"]
[12,"Ludoteca"]
[13,"Pista_para_caminar"]
[14,"Ciclovia"]
[15,"Pista_de_patinaje"]
[16,"Cancha_basquetbol"]
[17,"Chapoteadero"]
[18,"Ejercitadores_en_parque"]
[19,"Terraza"]
[20,"Bar"]
[21,"Cancha_de_futbol"]
[22,"Área_de_lectura"]
[23,"Jacuzzi"]
[24,"Salon de_juegos_"]
[25,"Sala_de_juntas"]
[26,"Cancha_multifuncional"]
[27,"Salón_de_yoga"]
[28,"Zona_de_meditación"]
[29,"Owners_Lounge"]
[30,"Coworking"]
[31,"Social_room"]
[32,"Pista_para_patines_y_carritos"]
[33,"Pista_de_Jogging"]
[34,"Hamaqueros"]
[35,"Paraguas"]
[36,"Kayaks"]
[37,"Cancha_de_vóleibol"]
[38,"Minigolf"]
[39,"Mesa_para_juegos"]
[40,"Kiosco"]
[41,"Cine_bajo_las_estrellas"]
[42,"Área_para_picnic"]
[43,"Terraza_infantil"]
[44,"Schooling"]
[45,"Lago"]
[46,"Área para correr"]
[47,"Área_comercial"]
[48,"Cancha_de_squash"]
[49,"Trotapista"]

{"sheet":"Creditos","index":7,"n_rows":6,"n_cols":2,"rows_kept":6,"cut":false,"hidden":false,"merged":[]}
["id_creditos","Tipo_credito"]
[1,"Crédito_Infonavit"]
[2,"Crédito_Hipotecario"]
[3,"Crédito_Bancario"]
[4,"Crédito_interno"]
[5,"Crédito_Fovissste"]

{"sheet":"Ventas","index":8,"n_rows":2,"n_cols":9,"rows_kept":2,"cut":false,"hidden":false,"merged":[]}
["Fecha","Nombre_desarrollo","Tipo_proyecto","Ventas_acumuladas","Ventas_periodo","Inventario_disponible","Numero_de_viviendas_planeadas","Nota","Ventas_detenidas"]
[null,null,null,null,null,null,null,null,false]

{"sheet":"Precios","index":9,"n_rows":2,"n_cols":10,"rows_kept":2,"cut":false,"hidden":false,"merged":[]}
["Fecha","Nombre_desarrollo","Tipo_proyecto","Nombre_prototipos","M2","Precio","Unidades_vendidas","Notas","Financiamientos","Bono"]
[null,null,null,null,{"$f":"_xlfn.XLOOKUP(Tabla3_2[[#This Row],[Nombre_desarrollo]]&Tabla3_2[[#This Row],[Nombre_prototipos]],Tabla6[Nombre_desarrollo]&Tabla6[Nombre_prototipos],Tabla6[Medida_construcción],_xlfn.XLOOKUP(Tabla3_2[[#This Row],[Nombre_desarrollo]]&Tabla3_2[[#This Row],[Nombre_prototipos]],Tabla62[Nombre_desarrollo]&Tabla62[Nombre_prototipos],Tabla62[Medida_construcción],_xlfn.XLOOKUP(Tabla3_2[[#This Row],[Nombre_desarrollo]]&Tabla3_2[[#This Row],[Nombre_prototipos]],Tabla626[Nombre_desarrollo]&Tabla626[Nombre_prototipos],Tabla626[Medida_terreno],\"No encontrado\")))","v":0}]

{"sheet":"financiamiento_esquema","index":10,"n_rows":86,"n_cols":8,"rows_kept":86,"cut":false,"hidden":false,"merged":[]}
["id_financiamiento","nombre_esquema","descuento","interes_tipo","interes_tasa_anual","plazo_meses","moneda","notas"]
[1,"30-30-40 (24m) desc 2%",0.02,null,null,null,"MXN"]
[2,"50-50 firma desc 4%",0.04,null,null,null,"MXN"]
[3,"85-15 firma desc 2%",0.02,null,null,null,"MXN"]
[4,"80-20 firma",0,null,null,null,"MXN"]
[5,"50-30-20 (18m)",0,null,null,null,"MXN"]
[6,"50 enganche, 50 mensualidades hasta entrega",0,null,null,null,"MXN","Mensualidades hasta entrega"]
[7,"20-20-20-20-20 con hitos (6m,12m,18m)",0,null,null,null,"MXN"]
[8,"30 firma, 70 a 8m sin intereses",0,null,null,8,"MXN","Sin intereses"]
[9,"60 firma, 40 a 6m sin intereses desc 2.5%",2.5000000000000001E-2,null,null,6,"MXN","Sin intereses"]
[10,"90 firma, 10 entrega desc 5%",0.05,null,null,null,"MXN"]
[11,"Interno 60m 7% anual USD",0,"fija_anual",7.0000000000000007E-2,60,"USD","Financiamiento en dólares"]
[12,"48m sin intereses",0,null,null,48,"MXN","Sin intereses"]
[13,"30 eng, 10 mes1, 10 mes12, 50 firma",0,null,null,null,"MXN","Mes1 estimado"]
[14,"25 eng, 25 mes6, 25 mes12, 25 firma",0,null,null,null,"MXN"]
[15,"50 eng, 30 en 12m, 20 firma desc 3%",0.03,null,null,12,"MXN","30% en mensualidades"]
[16,"10 eng, 20 a 4m sin int, 70 escritura",0,null,null,4,"MXN","Sin intereses"]
[17,"35 eng, 55 a 12m sin int, 10 entrega desc 6%",0.06,null,null,12,"MXN","Sin intereses"]
[18,"30 eng, 70 a 12m sin int desc 5%",0.05,null,null,12,"MXN","Sin intereses"]
[19,"30 eng, 70 a 60m con 10% anual",0,"fija_anual",0.1,60,"MXN"]
[20,"35 eng, 65 a 24m sin int",0,null,null,24,"MXN","Sin intereses"]
[21,"30 eng, resto a 6m sin int desc 7.5%",7.4999999999999997E-2,null,null,6,"MXN","Sin intereses"]
[22,"50 eng, resto a 3m desc 8.25%",8.2500000000000004E-2,null,null,3,"MXN","Sin intereses"]
[23,"30 eng, 24m sin int",0,null,null,24,"MXN","Sin intereses"]
[24,"60 eng, 40 entrega desc 6%",0.06,null,null,null,"MXN"]
[25,"30 eng, 30m sin int",0,null,null,30,"MXN","Sin intereses"]
[26,"30 eng, 30 a los 3 meses y 30 a los 6 y 10 a la firma"]
[27,"20 eng 40 a los 3 meses, 30 a los 6 y 10 a la firma"]
[28,"30 eng y 70% a los 6 meses"]
[29,"50% enganche y 50% al final",0.05]
[30,"70% enganche y 30% al final",7.0000000000000007E-2]
[31,"90% enganche y 10% a la entrega",0.1]
[32,"35% enganche y 65% a la entrega"]
[33,"25% enganche, 25% a 6 msi, 50% entrega",0.03]
[34,"70% enganche y 30% al final",0.08]
[35,"20% eng, 45% a 18 msi y 35% contraentrega"]
[36,"20 eng, 25 a 18 msi y 55% entrega"]
[37,"10% eng, 25% a 18 msi y 65 entrega"]
[38,"30 MSI"]
[39,"30% enganche y 40% a msi"]
[40,"30% enganche, 18 mensualidades fijas y el resto contra entrega"]
[41,"30% eng y 70% a la firma"]
[42,"50% eng (10% a la firma, 10% al mes de la firma, 10% a los dos meses y 20% diferido a 8 meses durante construcción) y 50% a la entrega"]
[43,"25% eng y 75 a la entrega"]
[44,"50% eng y 50% a la entrega"]
[45,"12 msi con 7% desc"]
[46,"24 msi con 4% desc"]
[47,"36 msi"]
[48,"5% firma contrato, 5% mes 2, 5% mes 3, 35% a 24 meses y 50% entrega"]
[49,"25% eng, 35% a 24 meses, 40% entrega con 3%  desc"]
[50,"50% eng, 35% a 24 meses, 15% entrega con 7% desc"]
[51,"90% enganche y 10% a la entrega 7% desc"]
[52,"60% enganche, 40% entrega 2% de desc"]
[53,"25% enganche, 65% en 14 meses y 10% a la entrega"]
[54,"20% eng, 20% mes 4, 20% mes 8, 20% mes 12 y 15% mes 15"]
[55,"80% eng y 20% en 12 meses con un 8% de desc"]
[56,"30% eng , 20% en 24 msi y 50% entrega con 2% desc"]
[57,"30% eng, 40% pagosmens, trim o sem durante obra y 30% entrega con un 4% desc"]
[58,"50% eng, 25% a 12 meses y 25% al mes 24  con 5% des"]
[59,"50% eng, 50% entrega con 3% desc"]
[60,"10% eng, 10% en 12 meses y 80% al entregar"]
[61,"24 msi "]
[62," 25% enganche, el 55% a 12 meses sin interes y 20% a la entrega con un 2% de descuento, 2. 85% enganche, 15% a la entrega con un 7% de descuento. 3. 35% enganche y 65% a la entrega 4. Crédito negociable"]
[63,"30% de enganche, 10% al mes , 10% al mes 12 y 50% a la firma. Opción 2: 25% enganche, 25% al mes 6, 25% al mes 12 y 25% a la firma. Opción 3:  50% enganche y 30% en 12 pagos mensuales y el 20% restante a la firma de escrituras con un 3% de descuento."]
[64,"12 meses con el 10% anual, 24 meses con el 12% anual, 36 meses con el 14% anual y 60 meses con el 15% anual"]
[65,"70% enganche y 30% al final con 10% de desc"]
[66,"50% eng, 20% a meses durante const, 30% a la ent con 8%  desc"]
[67,"35% eng, 35% a meses durante const, 30% s la ent con 6% desc"]
[68,"50% enganche , 45% a 24 meses sin interereses y 5% contra entrega"]
[69,"30% enganche, 70% a 12 meses sin intereses o 36 meses con el 12% de interés"]
[70,"50% eng, 30% pagos diferidosy 20% entrega"]
[71,"20% eng, 70% pagos diferidos y 10% entrega"]
[72,"20% eng, 60% pagos diferidos y 20% entrega"]
[73,"20% eng, 20% mes 6, 20% mes 12 y 40% entrega"]
[74,"10% enganche, crédito negociable"]
[75,"70,000 enganche y 48 msi con 4 anualidades de $20,000"]
[76,"10% eng y 90% a la firma escrituras"]
[77,"10% eng y 84 msi"]
[78,"35% enganche y el 65% a 36 meses sin interes. Opción 2: 30% enganche y el resto a 12 meses sin interés, con el 10% de descuento. Opción 3: 30% enganche y el 70% a 12 meses sin interés con un 10% de descuento."]
[79,"Puedes hacer propuesta de pago solo que sea dentro del tiempo que dura la construccion"]
[80,"80% de enganche, 20% a la firma de escrituras y 7% descuento a precio de lista. Opción 2: 50% de enganche, 30% diferido a 30 pagos mensuales, 20% a la firma de escrituras y 3% de descuento en precio de lista. Opción 3: 30% de enganche, 50% diferido a 30 mensualidades y 20% a la firma de escrituras. Opción 4: 20% de enganche 20% cada 10 meses igual a 3 pagos en total 60% y 20% a la firma de escrituras. Opción 5: 20% de enganche, 60% diferido a 30 meses y 20% a la firma de escrituras. Opción 6: 30% de enganche, 20% diferido a 30 meses y 50% a la firma de escrituras. Opción 7: 25% de enganche, 25% en el mes 18 y 50% a la firma de escrituras."]
[81,"20% enganche, 40% a 24 mensualidades sin intereses y 40% a la entrega. 2. 30% enganche, 50% a 24 mensualidades si intereses, 20% a la entrega con un 3% de descuento. 3. 50% de enganche, 50% a 24 mensualidades sin intereses con un 5% de descuento"]
[82,"35% eng y el resto 18 msi"]
[83,"35% eng, 35% 6 msi y 30% entrega"]
[84,"30% enganche, 60% a 9 meses y 10% a la firma escrituras"]
[85,"60 MSI"]

{"sheet":"bon_esquema","index":11,"n_rows":12,"n_cols":14,"rows_kept":12,"cut":false,"hidden":false,"merged":[]}
["bono_id","nombre_bono","tipo","valor","base_aplicacion","valido_desde","valido_hasta","notas",null,"tipo","Descripción",null,"base_aplicacion","Descripción"]
[1,"Bono base 1%","PCT",0.01,"LISTA","2025-03-01","2025-06-30","Descuento general sobre precio de lista",null,"PCT","porcentaje (usa 0.03 para 3%)",null,"LISTA","se calcula sobre precio de lista."]
[2,"Bono Contado $50k","MONTO",50000,"DESPUES_FIN","2025-01-01","2025-12-31","No acumulable, se aplica después del descuento de financiamiento",null,"MONTO","monto fijo en $",null,"DESPUES_FIN","sobre el precio ya con descuento del financiamiento."]
[3,"Bono Torre A 2%","PCT",0.02,"LISTA","2025-01-01","2025-12-31","Aplica solo a unidades con tag 'torre_a'",null,"Equipamiento","Los quipamientos que se les da",null,"DESPUES_BONOS","secuencia posterior (por si apilas más de un bono)."]
[4,"Bono equipamiento","Equipamiento","1 Minisplit","PROTOTIPO","2025-01-02","2025-12-32","Se regala 1 minisplit en la compra de la unidad",null,"Equipamiento_peso","Valor del equipamiento en pesos",null,"PROTOTIPO","Aplica a sobre el prototipo "]
[5,"Bono equipamiento $","Equipamiento_peso",250000,"PROTOTIPO","2025-01-03","2025-12-33","Se da un regalo en equimaineto para la unidad con un valor de $250,000 pesos",null,"Escritura","Regalo de la escrituración"]
[6,"Bono escritura","Escritura","Escritura","PROTOTIPO","2025-01-04","2025-12-34","Se regala la escrituración de la unidad"]
[7,"5% de descuento","PTC",0.05,"LISTA","2025-10-01","2025-10-31"]
[8,"26% desc dando 90% enganche"]
[9,"Equipamiento",null,null,null,null,null,"Cocina integral, closets, canceles de baño y minisplits instalados"]
[10,"Descuento 15% entrega inmediata"]
[11,"Bono de $200,000"]

{"sheet":"financiamiento_detalle","index":12,"n_rows":61,"n_cols":11,"rows_kept":61,"cut":false,"hidden":false,"merged":[]}
["id_financiamiento","orden","tipo_etapa","porcentaje","meses","descripcion",null,null,null,"tipo_etapa","Descripción"]
[1,1,"Enganche",0.3,0,"A la firma del contrato",null,null,null,"Enganche","Pago inicial para apartar y formalizar el contrato."]
[1,2,"Mensualidades",0.3,24,"Pagos mensuales iguales",null,null,null,"Mensualidades","Parte del precio dividida en pagos iguales durante N meses. Puede ser con o sin intereses (lo indica el esquema)."]
[1,3,"Firma/Escrituras",0.4,0,"A la firma de escrituras",null,null,null,"Hito","Pago único ligado a una fecha o condición específica. En un mes puntual (mes 6, mes 12, etc.) o al cumplir un avance de obra (“estructura”, “torre terminada”, “cristales”)."]
[2,1,"Enganche",0.5,0,"A la firma",null,null,null,"Firma/Escrituras","Pago único al firmar la escritura pública (escrituración) ante notaría."]
[2,2,"Firma/Escrituras",0.5,0,"A la firma de escrituras",null,null,null,"Entrega","Pago único al recibir el inmueble (contraentrega/entrega de llaves)."]
[3,1,"Enganche",0.85,0,"A la firma"]
[3,2,"Firma/Escrituras",0.15,0,"A la firma de escrituras"]
[4,1,"Enganche",0.8,0,"A la firma"]
[4,2,"Firma/Escrituras",0.2,0,"A la firma de escrituras"]
[5,1,"Enganche",0.5,0,"A la firma"]
[5,2,"Mensualidades",0.3,18,"Pagos mensuales iguales"]
[5,3,"Firma/Escrituras",0.2,0,"A la firma de escrituras"]
[6,1,"Enganche",0.5,0,"A la firma"]
[6,2,"Mensualidades",0.5,null,"Hasta entrega (meses por definir)"]
[7,1,"Enganche",0.2,0,"A la firma"]
[7,2,"Hito",0.2,6,"Mes 6"]
[7,3,"Hito",0.2,12,"Mes 12"]
[7,4,"Hito",0.2,18,"Mes 18"]
[7,5,"Firma/Escrituras",0.2,0,"A la firma de escrituras"]
[8,1,"Enganche",0.3,0,"A la firma de contrato"]
[8,2,"Mensualidades",0.7,8,"Sin intereses"]
[9,1,"Enganche",0.6,0,"A la firma de contrato"]
[9,2,"Mensualidades",0.4,6,"Sin intereses"]
[10,1,"Enganche",0.9,0,"A la firma"]
[10,2,"Entrega",0.1,0,"A la entrega"]
[11,1,"Mensualidades",1,60,"Tasa fija anual 7% USD"]
[12,1,"Mensualidades",1,48,"Sin intereses"]
[13,1,"Enganche",0.3,0,"A la firma"]
[13,2,"Hito",0.1,1,"Mes 1 (texto: 'al mes')"]
[13,3,"Hito",0.1,12,"Mes 12"]
[13,4,"Firma/Escrituras",0.5,0,"A la firma de escrituras"]
[14,1,"Enganche",0.25,0,"A la firma"]
[14,2,"Hito",0.25,6,"Mes 6"]
[14,3,"Hito",0.25,12,"Mes 12"]
[14,4,"Firma/Escrituras",0.25,0,"A la firma de escrituras"]
[15,1,"Enganche",0.5,0,"A la firma"]
[15,2,"Mensualidades",0.3,12,"Pagos mensuales"]
[15,3,"Firma/Escrituras",0.2,0,"A la firma de escrituras"]
[16,1,"Enganche",0.1,0,"A la firma"]
[16,2,"Mensualidades",0.2,4,"Sin intereses"]
[16,3,"Firma/Escrituras",0.7,0,"Escrituración"]
[17,1,"Enganche",0.35,0,"A la firma"]
[17,2,"Mensualidades",0.55000000000000004,12,"Sin intereses"]
[17,3,"Entrega",0.1,0,"A la entrega"]
[18,1,"Enganche",0.3,0,"A la firma"]
[18,2,"Mensualidades",0.7,12,"Sin intereses"]
[19,1,"Enganche",0.3,0,"A la firma"]
[19,2,"Mensualidades",0.7,60,"10% anual"]
[20,1,"Enganche",0.35,0,"A la firma"]
[20,2,"Mensualidades",0.65,24,"Sin intereses"]
[21,1,"Enganche",0.3,0,"A la firma"]
[21,2,"Mensualidades",0.7,6,"Sin intereses"]
[22,1,"Enganche",0.5,0,"A la firma"]
[22,2,"Mensualidades",0.5,3,"Sin intereses"]
[23,1,"Enganche",0.3,0,"A la firma"]
[23,2,"Mensualidades",0.7,24,"Sin intereses"]
[24,1,"Enganche",0.6,0,"A la firma"]
[24,2,"Entrega",0.4,0,"A la entrega"]
[25,1,"Enganche",0.3,0,"A la firma"]
[25,2,"Mensualidades",0.7,30,"Sin intereses"]

{"sheet":"Comercializadores","index":13,"n_rows":0,"n_cols":0,"rows_kept":0,"cut":false,"hidden":true,"merged":[]}

{"sheet":"Desarrolladores","index":14,"n_rows":0,"n_cols":0,"rows_kept":0,"cut":false,"hidden":true,"merged":[]}

{"sheet":"Tipo_cambio","index":15,"n_rows":0,"n_cols":0,"rows_kept":0,"cut":false,"hidden":true,"merged":[]}

{"sheet":"Reportes","index":16,"n_rows":0,"n_cols":0,"rows_kept":0,"cut":false,"hidden":false,"merged":[]}